{"text_format":"1","workbook":"xlsx","n_sheets":3,"sheets":["Sheet1","Drop down lists","Master"],"not_rendered":{"charts":0,"images":0,"macros":1,"external_links":0,"defined_names":1,"comments":0,"pivot_tables":0},"unopened":[],"bounds":{"document_bytes":16777216,"sheet_cells":100000,"rows_first":2000,"rows_last":500,"rows_between":2000,"halvings":0,"cell_chars":16384,"cell_head_chars":4096},"cells_cut":0,"cells_raw":0,"read":"whole","date_system":"1900"}

{"sheet":"Sheet1","index":0,"n_rows":19,"n_cols":11,"rows_kept":19,"cut":false,"hidden":false,"merged":[[18,0,18,2],[18,3,18,6],[18,7,18,10],[16,0,16,2],[16,3,16,6],[16,7,16,10],[17,0,17,2],[17,3,17,6],[17,7,17,10],[11,7,15,7],[11,8,15,8],[11,9,15,9],[11,10,15,10],[0,0,0,10],[1,0,1,10],[7,2,7,7],[7,8,7,10],[3,0,3,7],[5,3,5,5],[9,0,10,0],[9,1,9,2],[9,3,9,6],[9,7,9,10],[11,4,15,4]]}
["CRITICAL CONNECT"]
["Benefit Illustration in respect of policies offered on individual and family floater basis"]
["Plan","Plan A","Plan A Sub Option","9 CIs","Sum Insured",1000000,"Policy Tenure","1 year"]
["Plan B Sub Option"]
["Heart Protect","NA","Cancer Protect","NA","RenoLiv Protect","NA","Brain Protect","NA"]
["Otional Loan Protector Cover",null,"No","Optional Waiver for 30-Day Survival period",null,null,"Yes"]
["1st Adult Age",60,"2nd Adult Age",50,"1st Child Age",5,"2nd Child Age",10]
["3rd Child Age",25,"",null,null,null,null,null,"UIN: LIBHLIP21506V022021"]
{"$rows_left_out":12}
{"sheet":"Drop down lists","index":1,"n_rows":102,"n_cols":20,"rows_kept":102,"cut":false,"hidden":true,"merged":[]}
["Sum Insured","No. of Insured","No. of Children","Ind/Nominne Relationship","Plan","Plan A options","Plan B options",null,"Loading","Loading",null,null,"Nominee Relation","Occupation","Loan Tenure","Bank/Financier Name","Type of Loan","Applicant Status","Tenure","Age"]
[100000,0,0,"Self","Plan A","9 CIs","Heart Protect",null,0,"NA","Yes","Male","Self","Salaried","6 Months","HDFC Bank Ltd.","Home Loan","Borrower","1 year",5]
[200000,1,1,"Spouse","Plan B","25 CIs","Cancer Protect",null,0.05,null,"No","Female","Spouse","Housewife","9 Months","ICICI Bank","Loan Against Property","Co-Borrower","2 years",6]
[300000,2,2,"Son","Plan A&B","43 CIs","Renoliv Protect",null,0.1,null,null,null,"Son","Student","1 Year","Union Bank of India","Personal Loan",null,"3 years",7]
[400000,3,3,"Daughter",null,null,"Brain Protect",null,0.15,null,null,null,"Daughter","Retired","1.5 Years","AXIS Bank","Business Loan",null,null,8]
[500000,4,4,"Mother",null,null,null,null,0.2,null,null,null,"Mother","Others","2 Years","Kotak Bank","Gold Loan",null,null,9]
[600000,5,null,"Father",null,null,null,null,0.25,null,null,null,"Father",null,"3 Years",null,"Vehicle Loan",null,null,10]
[700000,null,null,"Brother",null,null,null,null,0.3,null,null,null,"Brother",null,"4 Years",null,"Education Loan",null,null,11]
{"$rows_left_out":95}
{"sheet":"Master","index":2,"n_rows":1112,"n_cols":44,"rows_kept":1112,"cut":false,"hidden":true,"merged":[[38,34,38,35],[38,36,38,37],[12,34,12,35],[2,15,3,15],[2,16,3,16],[2,17,3,17],[2,18,3,18],[2,19,3,19],[2,21,3,21],[2,22,2,25],[2,26,2,27],[2,20,3,20]]}
["Sum Insured","Age Band ","SI&Age Band","9 CIs","25 CIs","43 CIs","Heart Protect","Cancer Protect","RenoLiv Protect","Brain Protect"]
[100000,"91 days - 25 years",{"$f":"B2&A2","v":"91 days - 25 years100000"},284,315,381,252,242,203,231,null,null,null,null,null,"Working"]
[100000,"26 years - 30 years",{"$f":"B3&A3","v":"26 years - 30 years100000"},323,350,421,276,260,207,242,null,null,null,"Age Band",null,"Sr. No.","Insured Name","Age","Age band","Sum insured","Match","Plan A Base Premium","Plan B",null,null,null,"Optional Cover"]
[100000,"31 years - 35 years","31 years - 35 years100000",422,450,563,386,297,216,265,null,0.25,25,"91 days - 25 years",null,null,null,null,null,null,null,null,{"$f":"IF(Sheet1!B5=\"Yes\",\"Heart Protect\",\"Heart Protect not opted\")","v":"Heart Protect not opted"},{"$f":"IF(Sheet1!D5=\"Yes\",\"Cancer Protect\",\"Cancer Protect not opted\")","v":"Cancer Protect not opted"},{"$f":"IF(Sheet1!$F$5=\"Yes\",\"RenoLiv Protect\",\"RenoLiv Protect not opted\")","v":"RenoLiv Protect not opted"},{"$f":"IF(Sheet1!$H$5=\"Yes\",\"Brain Protect\",\"Brain Protect not opted\")","v":"Brain Protect not opted"},"Loan Protector","30day Waiver","Total","Total with installment","Concat","Plan A Total","Plan B Total","Plan A with long term discount","Plan A with long term and Family discount","Plan B with long term discount","Plan B with long term and Family discount"]
[100000,"36 years - 40 years","36 years - 40 years100000",535,559,715,612,355,227,300,null,26,30,"26 years - 30 years",null,{"$f":"#REF!","v":{"$error":"#REF!"}},null,{"$f":"IF(Sheet1!B7=\"\",\"\",Sheet1!B7)","v":60},{"$f":"IFERROR(LOOKUP(R5,$L$4:$N$14),0)","v":"56 years - 60 years"},{"$f":"IF(R5=\"\",\"\",Sheet1!$F$3)","v":1000000},{"$f":"S5&T5","v":"56 years - 60 years1000000"},{"$f":"IF(OR(Sheet1!$B$3=\"Plan B\",Sheet1!$D$3=\"NA\",Sheet1!$D$3=\"Please Select\"),0,IF(Sheet1!$H$3=\"1 year\",IFERROR(INDEX(Master!$C$1:$J$1112,MATCH(Master!U5,Master!$C$1:$C$1112,0),MATCH(Sheet1!$D$3,Master!$C$1:$J$1,0)),0),IF(Sheet1!$H$3=\"2 years\",IFERROR(INDEX(Master!$C$1:$J$1112,MATCH(Master!U5,Master!$C$1:$C$1112,0),MATCH(Sheet1!$D$3,Master!$C$1:$J$1,0))*2,0),IFERROR(INDEX(Master!$C$1:$J$1112,MATCH(Master!U5,Master!$C$1:$C$1112,0),MATCH(Sheet1!$D$3,Master!$C$1:$J$1,0))*3,0))))","v":25015},{"$f":"IF(OR(Sheet1!$B$3=\"Plan A\",Sheet1!$B$5=\"NA\",Sheet1!$B$5=\"No\",Sheet1!$B$5=\"Please Select\"),0,IF(Sheet1!$H$3=\"1 year\",IFERROR(INDEX(Master!$C$1:$J$1112,MATCH(Master!U5,Master!$C$1:$C$1112,0),MATCH($W$4,Master!$C$1:$J$1,0)),0),IF(Sheet1!$H$3=\"2 years\",IFERROR(INDEX(Master!$C$1:$J$1112,MATCH(Master!U5,Master!$C$1:$C$1112,0),MATCH($W$4,Master!$C$1:$J$1,0))*2,0),IFERROR(INDEX(Master!$C$1:$J$1112,MATCH(Master!U5,Master!$C$1:$C$1112,0),MATCH($W$4,Master!$C$1:$J$1,0))*3,0))))","v":0},{"$f":"IF(OR(Sheet1!$B$3=\"Plan A\",Sheet1!$D$5=\"Please Select\",Sheet1!$D$5=\"NA\",Sheet1!$D$5=\"No\"),0,IF(Sheet1!$H$3=\"1 year\",IFERROR(INDEX(Master!$C$1:$J$1112,MATCH(Master!U5,Master!$C$1:$C$1112,0),MATCH($X$4,$C$1:$J$1,0)),0),IF(Sheet1!$H$3=\"2 years\",IFERROR(INDEX(Master!$C$1:$J$1112,MATCH(Master!U5,Master!$C$1:$C$1112,0),MATCH($X$4,$C$1:$J$1,0))*2,0),IFERROR(INDEX(Master!$C$1:$J$1112,MATCH(Master!U5,Master!$C$1:$C$1112,0),MATCH($X$4,$C$1:$J$1,0))*3,0))))","v":0},{"$f":"IF(OR(Sheet1!$B$3=\"Plan A\",Sheet1!$F$5=\"No\",Sheet1!$F$5=\"Please Select\",Sheet1!$F$5=\"NA\"),0,IF(Sheet1!$H$3=\"1 year\",IFERROR(INDEX(Master!$C$1:$J$1112,MATCH(Master!U5,Master!$C$1:$C$1112,0),MATCH($Y$4,Master!$C$1:$J$1,0)),0),IF(Sheet1!$H$3=\"2 years\",IFERROR(INDEX(Master!$C$1:$J$1112,MATCH(Master!U5,Master!$C$1:$C$1112,0),MATCH($Y$4,Master!$C$1:$J$1,0))*2,0),IFERROR(INDEX(Master!$C$1:$J$1112,MATCH(Master!U5,Master!$C$1:$C$1112,0),MATCH($Y$4,Master!$C$1:$J$1,0))*3,0))))","v":0},{"$f":"IF(OR(Sheet1!$B$3=\"Plan A\",Sheet1!$H$5=\"NA\",Sheet1!$H$5=\"No\",Sheet1!$H$5=\"Please Select\"),0,IF(Sheet1!$H$3=\"1 year\",IFERROR(INDEX(Master!$C$1:$J$1112,MATCH(Master!U5,Master!$C$1:$C$1112,0),MATCH($Z$4,Master!$C$1:$J$1,0)),0),IF(Sheet1!$H$3=\"2 years\",IFERROR(INDEX(Master!$C$1:$J$1112,MATCH(Master!U5,Master!$C$1:$C$1112,0),MATCH($Z$4,Master!$C$1:$J$1,0))*2,0),IFERROR(INDEX(Master!$C$1:$J$1112,MATCH(Master!U5,Master!$C$1:$C$1112,0),MATCH($Z$4,Master!$C$1:$J$1,0))*3,0))))","v":0},{"$f":"IF(OR(Sheet1!$C$6=\"No\",Sheet1!$C$6=\"Please Select\"),0,IF(Sheet1!$B$3=\"Plan A\",Master!V5*3%,IF(Sheet1!$B$3=\"Plan B\",SUM(W5:Z5)*3%,SUM(V5:Z5)*3%)))","v":0},{"$f":"IF(OR(Sheet1!$G$6=\"No\",Sheet1!$G$6=\"Please Select\"),0,IF(Sheet1!$B$3=\"Plan A\",Master!V5*5%,IF(Sheet1!$B$3=\"Plan B\",SUM(W5:Z5)*6%,(Master!V5*5%)+(SUM(W5:Z5)*6%))))","v":1250.75},{"$f":"IF(Sheet1!$B$3=\"Plan A\",V5+AA5+AB5,IF(Sheet1!$B$3=\"Plan B\",SUM(W5:AB5),SUM(V5:AB5)))","v":26265.75},null,null,{"$f":"IF(AND(Sheet1!$C$6=\"Yes\",Sheet1!$G$6=\"Yes\"),V5+((V5*3%)+(Master!V5*5%)),IF(AND(Sheet1!$C$6=\"Yes\",Sheet1!$G$6=\"No\"),V5+(V5*3%),IF(AND(Sheet1!$C$6=\"No\",Sheet1!$G$6=\"Yes\"),V5+(Master!V5*5%),V5)))","v":26265.75},{"$f":"IF(AND(Sheet1!$C$6=\"Yes\",Sheet1!$G$6=\"Yes\"),SUM(W5:Z5)+((SUM(W5:Z5)*3%)+(SUM(W5:Z5)*6%)),IF(AND(Sheet1!$C$6=\"Yes\",Sheet1!$G$6=\"No\"),SUM(W5:Z5)+(SUM(W5:Z5)*3%),IF(AND(Sheet1!$C$6=\"No\",Sheet1!$G$6=\"Yes\"),SUM(W5:Z5)+(SUM(W5:Z5)*6%),SUM(W5:Z5))))","v":0},{"$f":"AF5*(100%-$AM$17)","v":26265.75},{"$f":"AF5*(100%-$AM$16-$AM$17)","v":23639.174999999999},{"$f":"AG5*(100%-$AM$17)","v":0},{"$f":"AG5*(100%-$AM$16-$AM$17)","v":0},{"$f":"IF(Sheet1!B3=\"Plan A\",\"Total Premium for all members of the family is, Rs.\"&\" \"&ROUND(AH10,0)&\" \"&\"(excluding GST) when each member is covered separately.\",\"Total Premium for all members of the family is, Rs.\"&\" \"&ROUND(AJ10,0)&\" \"&\"(excluding GST) when each member is covered separately.\")","v":"Total Premium for all members of the family is, Rs. 39761 (excluding GST) when each member is covered separately."},{"$f":"IF(Sheet1!B3=\"Plan A\",\"Total Premium for all members of the family is, Rs.\"&\" \"&ROUND(Master!AI10,0)&\" \"&\"(excluding GST)  when they are covered under a single policy\",\"Total Premium for all members of the family is, Rs.\"&\" \"&ROUND(Master!AK10,0)&\" \"&\"(excluding GST)  when they are covered under a single policy\")","v":"Total Premium for all members of the family is, Rs. 35785 (excluding GST)  when they are covered under a single policy"}]
[100000,"41 years - 45 years","41 years - 45 years100000",837,865,1144,1070,461,245,354,null,31,35,"31 years - 35 years",null,{"$f":"#REF!","v":{"$error":"#REF!"}},null,{"$f":"IF(Sheet1!D7=\"\",\"\",Sheet1!D7)","v":50},{"$f":"IFERROR(LOOKUP(R6,$L$4:$N$14),0)","v":"46 years - 50 years"},{"$f":"IF(R6=\"\",\"\",Sheet1!$F$3)","v":1000000},{"$f":"IF(R6=\"\",\"\",S6&T6)","v":"46 years - 50 years1000000"},{"$f":"IF(OR(Sheet1!$B$3=\"Plan B\",Sheet1!$D$3=\"NA\",Sheet1!$D$3=\"Please Select\"),0,IF(Sheet1!$H$3=\"1 year\",IFERROR(INDEX(Master!$C$1:$J$1112,MATCH(Master!U6,Master!$C$1:$C$1112,0),MATCH(Sheet1!$D$3,Master!$C$1:$J$1,0)),0),IF(Sheet1!$H$3=\"2 years\",IFERROR(INDEX(Master!$C$1:$J$1112,MATCH(Master!U6,Master!$C$1:$C$1112,0),MATCH(Sheet1!$D$3,Master!$C$1:$J$1,0))*2,0),IFERROR(INDEX(Master!$C$1:$J$1112,MATCH(Master!U6,Master!$C$1:$C$1112,0),MATCH(Sheet1!$D$3,Master!$C$1:$J$1,0))*3,0))))","v":9097},{"$f":"IF(OR(Sheet1!$B$3=\"Plan A\",Sheet1!$B$5=\"NA\",Sheet1!$B$5=\"No\",Sheet1!$B$5=\"Please Select\"),0,IF(Sheet1!$H$3=\"1 year\",IFERROR(INDEX(Master!$C$1:$J$1112,MATCH(Master!U6,Master!$C$1:$C$1112,0),MATCH($W$4,Master!$C$1:$J$1,0)),0),IF(Sheet1!$H$3=\"2 years\",IFERROR(INDEX(Master!$C$1:$J$1112,MATCH(Master!U6,Master!$C$1:$C$1112,0),MATCH($W$4,Master!$C$1:$J$1,0))*2,0),IFERROR(INDEX(Master!$C$1:$J$1112,MATCH(Master!U6,Master!$C$1:$C$1112,0),MATCH($W$4,Master!$C$1:$J$1,0))*3,0))))","v":0},{"$f":"IF(OR(Sheet1!$B$3=\"Plan A\",Sheet1!$D$5=\"Please Select\",Sheet1!$D$5=\"NA\",Sheet1!$D$5=\"No\"),0,IF(Sheet1!$H$3=\"1 year\",IFERROR(INDEX(Master!$C$1:$J$1112,MATCH(Master!U6,Master!$C$1:$C$1112,0),MATCH($X$4,$C$1:$J$1,0)),0),IF(Sheet1!$H$3=\"2 years\",IFERROR(INDEX(Master!$C$1:$J$1112,MATCH(Master!U6,Master!$C$1:$C$1112,0),MATCH($X$4,$C$1:$J$1,0))*2,0),IFERROR(INDEX(Master!$C$1:$J$1112,MATCH(Master!U6,Master!$C$1:$C$1112,0),MATCH($X$4,$C$1:$J$1,0))*3,0))))","v":0},{"$f":"IF(OR(Sheet1!$B$3=\"Plan A\",Sheet1!$F$5=\"No\",Sheet1!$F$5=\"Please Select\",Sheet1!$F$5=\"NA\"),0,IF(Sheet1!$H$3=\"1 year\",IFERROR(INDEX(Master!$C$1:$J$1112,MATCH(Master!U6,Master!$C$1:$C$1112,0),MATCH($Y$4,Master!$C$1:$J$1,0)),0),IF(Sheet1!$H$3=\"2 years\",IFERROR(INDEX(Master!$C$1:$J$1112,MATCH(Master!U6,Master!$C$1:$C$1112,0),MATCH($Y$4,Master!$C$1:$J$1,0))*2,0),IFERROR(INDEX(Master!$C$1:$J$1112,MATCH(Master!U6,Master!$C$1:$C$1112,0),MATCH($Y$4,Master!$C$1:$J$1,0))*3,0))))","v":0},{"$f":"IF(OR(Sheet1!$B$3=\"Plan A\",Sheet1!$H$5=\"NA\",Sheet1!$H$5=\"No\",Sheet1!$H$5=\"Please Select\"),0,IF(Sheet1!$H$3=\"1 year\",IFERROR(INDEX(Master!$C$1:$J$1112,MATCH(Master!U6,Master!$C$1:$C$1112,0),MATCH($Z$4,Master!$C$1:$J$1,0)),0),IF(Sheet1!$H$3=\"2 years\",IFERROR(INDEX(Master!$C$1:$J$1112,MATCH(Master!U6,Master!$C$1:$C$1112,0),MATCH($Z$4,Master!$C$1:$J$1,0))*2,0),IFERROR(INDEX(Master!$C$1:$J$1112,MATCH(Master!U6,Master!$C$1:$C$1112,0),MATCH($Z$4,Master!$C$1:$J$1,0))*3,0))))","v":0},{"$f":"IF(OR(Sheet1!$C$6=\"No\",Sheet1!$C$6=\"Please Select\"),0,IF(Sheet1!$B$3=\"Plan A\",Master!V6*3%,IF(Sheet1!$B$3=\"Plan B\",SUM(W6:Z6)*3%,SUM(V6:Z6)*3%)))","v":0},{"$f":"IF(OR(Sheet1!$G$6=\"No\",Sheet1!$G$6=\"Please Select\"),0,IF(Sheet1!$B$3=\"Plan A\",Master!V6*5%,IF(Sheet1!$B$3=\"Plan B\",SUM(W6:Z6)*6%,(Master!V6*5%)+(SUM(W6:Z6)*6%))))","v":454.85},{"$f":"IF(Sheet1!$B$3=\"Plan A\",V6+AA6+AB6,IF(Sheet1!$B$3=\"Plan B\",SUM(W6:AB6),SUM(V6:AB6)))","v":9551.85},null,null,{"$f":"IF(AND(Sheet1!$C$6=\"Yes\",Sheet1!$G$6=\"Yes\"),V6+((V6*3%)+(Master!V6*5%)),IF(AND(Sheet1!$C$6=\"Yes\",Sheet1!$G$6=\"No\"),V6+(V6*3%),IF(AND(Sheet1!$C$6=\"No\",Sheet1!$G$6=\"Yes\"),V6+(Master!V6*5%),V6)))","v":9551.85},{"$f":"IF(AND(Sheet1!$C$6=\"Yes\",Sheet1!$G$6=\"Yes\"),SUM(W6:Z6)+((SUM(W6:Z6)*3%)+(SUM(W6:Z6)*6%)),IF(AND(Sheet1!$C$6=\"Yes\",Sheet1!$G$6=\"No\"),SUM(W6:Z6)+(SUM(W6:Z6)*3%),IF(AND(Sheet1!$C$6=\"No\",Sheet1!$G$6=\"Yes\"),SUM(W6:Z6)+(SUM(W6:Z6)*6%),SUM(W6:Z6))))","v":0},{"$f":"AF6*(100%-$AM$17)","v":9551.85},{"$f":"AF6*(100%-$AM$16-$AM$17)","v":8596.6650000000009},{"$f":"AG6*(100%-$AM$17)","v":0},{"$f":"AG6*(100%-$AM$16-$AM$17)","v":0},{"$f":"\"Sum insured available for each individual is Rs.\"&\" \"&Sheet1!F3","v":"Sum insured available for each individual is Rs. 1000000"},{"$f":"\"Sum insured available for each family member is Rs.\"&\" \"&Sheet1!F3","v":"Sum insured available for each family member is Rs. 1000000"}]
[100000,"46 years - 50 years","46 years - 50 years100000",1058,1177,2167,1679,649,267,434,null,36,40,"36 years - 40 years",null,{"$f":"#REF!","v":{"$error":"#REF!"}},null,{"$f":"IF(Sheet1!F7=\"\",\"\",Sheet1!F7)","v":5},"91 days - 25 years",{"$f":"IF(R7=\"\",\"\",Sheet1!$F$3)","v":1000000},{"$f":"IF(R7=\"\",\"\",S7&T7)","v":"91 days - 25 years1000000"},{"$f":"IF(OR(Sheet1!$B$3=\"Plan B\",Sheet1!$D$3=\"NA\",Sheet1!$D$3=\"Please Select\"),0,IF(Sheet1!$H$3=\"1 year\",IFERROR(INDEX(Master!$C$1:$J$1112,MATCH(Master!U7,Master!$C$1:$C$1112,0),MATCH(Sheet1!$D$3,Master!$C$1:$J$1,0)),0),IF(Sheet1!$H$3=\"2 years\",IFERROR(INDEX(Master!$C$1:$J$1112,MATCH(Master!U7,Master!$C$1:$C$1112,0),MATCH(Sheet1!$D$3,Master!$C$1:$J$1,0))*2,0),IFERROR(INDEX(Master!$C$1:$J$1112,MATCH(Master!U7,Master!$C$1:$C$1112,0),MATCH(Sheet1!$D$3,Master!$C$1:$J$1,0))*3,0))))","v":1252},{"$f":"IF(OR(Sheet1!$B$3=\"Plan A\",Sheet1!$B$5=\"NA\",Sheet1!$B$5=\"No\",Sheet1!$B$5=\"Please Select\"),0,IF(Sheet1!$H$3=\"1 year\",IFERROR(INDEX(Master!$C$1:$J$1112,MATCH(Master!U7,Master!$C$1:$C$1112,0),MATCH($W$4,Master!$C$1:$J$1,0)),0),IF(Sheet1!$H$3=\"2 years\",IFERROR(INDEX(Master!$C$1:$J$1112,MATCH(Master!U7,Master!$C$1:$C$1112,0),MATCH($W$4,Master!$C$1:$J$1,0))*2,0),IFERROR(INDEX(Master!$C$1:$J$1112,MATCH(Master!U7,Master!$C$1:$C$1112,0),MATCH($W$4,Master!$C$1:$J$1,0))*3,0))))","v":0},{"$f":"IF(OR(Sheet1!$B$3=\"Plan A\",Sheet1!$D$5=\"Please Select\",Sheet1!$D$5=\"NA\",Sheet1!$D$5=\"No\"),0,IF(Sheet1!$H$3=\"1 year\",IFERROR(INDEX(Master!$C$1:$J$1112,MATCH(Master!U7,Master!$C$1:$C$1112,0),MATCH($X$4,$C$1:$J$1,0)),0),IF(Sheet1!$H$3=\"2 years\",IFERROR(INDEX(Master!$C$1:$J$1112,MATCH(Master!U7,Master!$C$1:$C$1112,0),MATCH($X$4,$C$1:$J$1,0))*2,0),IFERROR(INDEX(Master!$C$1:$J$1112,MATCH(Master!U7,Master!$C$1:$C$1112,0),MATCH($X$4,$C$1:$J$1,0))*3,0))))","v":0},{"$f":"IF(OR(Sheet1!$B$3=\"Plan A\",Sheet1!$F$5=\"No\",Sheet1!$F$5=\"Please Select\",Sheet1!$F$5=\"NA\"),0,IF(Sheet1!$H$3=\"1 year\",IFERROR(INDEX(Master!$C$1:$J$1112,MATCH(Master!U7,Master!$C$1:$C$1112,0),MATCH($Y$4,Master!$C$1:$J$1,0)),0),IF(Sheet1!$H$3=\"2 years\",IFERROR(INDEX(Master!$C$1:$J$1112,MATCH(Master!U7,Master!$C$1:$C$1112,0),MATCH($Y$4,Master!$C$1:$J$1,0))*2,0),IFERROR(INDEX(Master!$C$1:$J$1112,MATCH(Master!U7,Master!$C$1:$C$1112,0),MATCH($Y$4,Master!$C$1:$J$1,0))*3,0))))","v":0},{"$f":"IF(OR(Sheet1!$B$3=\"Plan A\",Sheet1!$H$5=\"NA\",Sheet1!$H$5=\"No\",Sheet1!$H$5=\"Please Select\"),0,IF(Sheet1!$H$3=\"1 year\",IFERROR(INDEX(Master!$C$1:$J$1112,MATCH(Master!U7,Master!$C$1:$C$1112,0),MATCH($Z$4,Master!$C$1:$J$1,0)),0),IF(Sheet1!$H$3=\"2 years\",IFERROR(INDEX(Master!$C$1:$J$1112,MATCH(Master!U7,Master!$C$1:$C$1112,0),MATCH($Z$4,Master!$C$1:$J$1,0))*2,0),IFERROR(INDEX(Master!$C$1:$J$1112,MATCH(Master!U7,Master!$C$1:$C$1112,0),MATCH($Z$4,Master!$C$1:$J$1,0))*3,0))))","v":0},{"$f":"IF(OR(Sheet1!$C$6=\"No\",Sheet1!$C$6=\"Please Select\"),0,IF(Sheet1!$B$3=\"Plan A\",Master!V7*3%,IF(Sheet1!$B$3=\"Plan B\",SUM(W7:Z7)*3%,SUM(V7:Z7)*3%)))","v":0},{"$f":"IF(OR(Sheet1!$G$6=\"No\",Sheet1!$G$6=\"Please Select\"),0,IF(Sheet1!$B$3=\"Plan A\",Master!V7*5%,IF(Sheet1!$B$3=\"Plan B\",SUM(W7:Z7)*6%,(Master!V7*5%)+(SUM(W7:Z7)*6%))))","v":62.6},{"$f":"IF(Sheet1!$B$3=\"Plan A\",V7+AA7+AB7,IF(Sheet1!$B$3=\"Plan B\",SUM(W7:AB7),SUM(V7:AB7)))","v":1314.6},null,null,{"$f":"IF(AND(Sheet1!$C$6=\"Yes\",Sheet1!$G$6=\"Yes\"),V7+((V7*3%)+(Master!V7*5%)),IF(AND(Sheet1!$C$6=\"Yes\",Sheet1!$G$6=\"No\"),V7+(V7*3%),IF(AND(Sheet1!$C$6=\"No\",Sheet1!$G$6=\"Yes\"),V7+(Master!V7*5%),V7)))","v":1314.6},{"$f":"IF(AND(Sheet1!$C$6=\"Yes\",Sheet1!$G$6=\"Yes\"),SUM(W7:Z7)+((SUM(W7:Z7)*3%)+(SUM(W7:Z7)*6%)),IF(AND(Sheet1!$C$6=\"Yes\",Sheet1!$G$6=\"No\"),SUM(W7:Z7)+(SUM(W7:Z7)*3%),IF(AND(Sheet1!$C$6=\"No\",Sheet1!$G$6=\"Yes\"),SUM(W7:Z7)+(SUM(W7:Z7)*6%),SUM(W7:Z7))))","v":0},1314.6,1183.1399999999999,0,0]
[100000,"51 years - 55 years","51 years - 55 years100000",1829,2018,3533,2587,946,297,553,null,41,45,"41 years - 45 years",null,{"$f":"#REF!","v":{"$error":"#REF!"}},null,{"$f":"IF(Sheet1!H7=\"\",\"\",Sheet1!H7)","v":10},"91 days - 25 years",{"$f":"IF(R8=\"\",\"\",Sheet1!$F$3)","v":1000000},"91 days - 25 years1000000",{"$f":"IF(OR(Sheet1!$B$3=\"Plan B\",Sheet1!$D$3=\"NA\",Sheet1!$D$3=\"Please Select\"),0,IF(Sheet1!$H$3=\"1 year\",IFERROR(INDEX(Master!$C$1:$J$1112,MATCH(Master!U8,Master!$C$1:$C$1112,0),MATCH(Sheet1!$D$3,Master!$C$1:$J$1,0)),0),IF(Sheet1!$H$3=\"2 years\",IFERROR(INDEX(Master!$C$1:$J$1112,MATCH(Master!U8,Master!$C$1:$C$1112,0),MATCH(Sheet1!$D$3,Master!$C$1:$J$1,0))*2,0),IFERROR(INDEX(Master!$C$1:$J$1112,MATCH(Master!U8,Master!$C$1:$C$1112,0),MATCH(Sheet1!$D$3,Master!$C$1:$J$1,0))*3,0))))","v":1252},{"$f":"IF(OR(Sheet1!$B$3=\"Plan A\",Sheet1!$B$5=\"NA\",Sheet1!$B$5=\"No\",Sheet1!$B$5=\"Please Select\"),0,IF(Sheet1!$H$3=\"1 year\",IFERROR(INDEX(Master!$C$1:$J$1112,MATCH(Master!U8,Master!$C$1:$C$1112,0),MATCH($W$4,Master!$C$1:$J$1,0)),0),IF(Sheet1!$H$3=\"2 years\",IFERROR(INDEX(Master!$C$1:$J$1112,MATCH(Master!U8,Master!$C$1:$C$1112,0),MATCH($W$4,Master!$C$1:$J$1,0))*2,0),IFERROR(INDEX(Master!$C$1:$J$1112,MATCH(Master!U8,Master!$C$1:$C$1112,0),MATCH($W$4,Master!$C$1:$J$1,0))*3,0))))","v":0},{"$f":"IF(OR(Sheet1!$B$3=\"Plan A\",Sheet1!$D$5=\"Please Select\",Sheet1!$D$5=\"NA\",Sheet1!$D$5=\"No\"),0,IF(Sheet1!$H$3=\"1 year\",IFERROR(INDEX(Master!$C$1:$J$1112,MATCH(Master!U8,Master!$C$1:$C$1112,0),MATCH($X$4,$C$1:$J$1,0)),0),IF(Sheet1!$H$3=\"2 years\",IFERROR(INDEX(Master!$C$1:$J$1112,MATCH(Master!U8,Master!$C$1:$C$1112,0),MATCH($X$4,$C$1:$J$1,0))*2,0),IFERROR(INDEX(Master!$C$1:$J$1112,MATCH(Master!U8,Master!$C$1:$C$1112,0),MATCH($X$4,$C$1:$J$1,0))*3,0))))","v":0},{"$f":"IF(OR(Sheet1!$B$3=\"Plan A\",Sheet1!$F$5=\"No\",Sheet1!$F$5=\"Please Select\",Sheet1!$F$5=\"NA\"),0,IF(Sheet1!$H$3=\"1 year\",IFERROR(INDEX(Master!$C$1:$J$1112,MATCH(Master!U8,Master!$C$1:$C$1112,0),MATCH($Y$4,Master!$C$1:$J$1,0)),0),IF(Sheet1!$H$3=\"2 years\",IFERROR(INDEX(Master!$C$1:$J$1112,MATCH(Master!U8,Master!$C$1:$C$1112,0),MATCH($Y$4,Master!$C$1:$J$1,0))*2,0),IFERROR(INDEX(Master!$C$1:$J$1112,MATCH(Master!U8,Master!$C$1:$C$1112,0),MATCH($Y$4,Master!$C$1:$J$1,0))*3,0))))","v":0},{"$f":"IF(OR(Sheet1!$B$3=\"Plan A\",Sheet1!$H$5=\"NA\",Sheet1!$H$5=\"No\",Sheet1!$H$5=\"Please Select\"),0,IF(Sheet1!$H$3=\"1 year\",IFERROR(INDEX(Master!$C$1:$J$1112,MATCH(Master!U8,Master!$C$1:$C$1112,0),MATCH($Z$4,Master!$C$1:$J$1,0)),0),IF(Sheet1!$H$3=\"2 years\",IFERROR(INDEX(Master!$C$1:$J$1112,MATCH(Master!U8,Master!$C$1:$C$1112,0),MATCH($Z$4,Master!$C$1:$J$1,0))*2,0),IFERROR(INDEX(Master!$C$1:$J$1112,MATCH(Master!U8,Master!$C$1:$C$1112,0),MATCH($Z$4,Master!$C$1:$J$1,0))*3,0))))","v":0},{"$f":"IF(OR(Sheet1!$C$6=\"No\",Sheet1!$C$6=\"Please Select\"),0,IF(Sheet1!$B$3=\"Plan A\",Master!V8*3%,IF(Sheet1!$B$3=\"Plan B\",SUM(W8:Z8)*3%,SUM(V8:Z8)*3%)))","v":0},{"$f":"IF(OR(Sheet1!$G$6=\"No\",Sheet1!$G$6=\"Please Select\"),0,IF(Sheet1!$B$3=\"Plan A\",Master!V8*5%,IF(Sheet1!$B$3=\"Plan B\",SUM(W8:Z8)*6%,(Master!V8*5%)+(SUM(W8:Z8)*6%))))","v":62.6},{"$f":"IF(Sheet1!$B$3=\"Plan A\",V8+AA8+AB8,IF(Sheet1!$B$3=\"Plan B\",SUM(W8:AB8),SUM(V8:AB8)))","v":1314.6},null,null,{"$f":"IF(AND(Sheet1!$C$6=\"Yes\",Sheet1!$G$6=\"Yes\"),V8+((V8*3%)+(Master!V8*5%)),IF(AND(Sheet1!$C$6=\"Yes\",Sheet1!$G$6=\"No\"),V8+(V8*3%),IF(AND(Sheet1!$C$6=\"No\",Sheet1!$G$6=\"Yes\"),V8+(Master!V8*5%),V8)))","v":1314.6},{"$f":"IF(AND(Sheet1!$C$6=\"Yes\",Sheet1!$G$6=\"Yes\"),SUM(W8:Z8)+((SUM(W8:Z8)*3%)+(SUM(W8:Z8)*6%)),IF(AND(Sheet1!$C$6=\"Yes\",Sheet1!$G$6=\"No\"),SUM(W8:Z8)+(SUM(W8:Z8)*3%),IF(AND(Sheet1!$C$6=\"No\",Sheet1!$G$6=\"Yes\"),SUM(W8:Z8)+(SUM(W8:Z8)*6%),SUM(W8:Z8))))","v":0},1314.6,1183.1399999999999,0,0]
{"$rows_left_out":1104}