{"text_format":"1","workbook":"xlsx","n_sheets":3,"sheets":["Sheet1","Drop down lists","Master"],"not_rendered":{"charts":0,"images":0,"macros":1,"external_links":0,"defined_names":1,"comments":0,"pivot_tables":0},"unopened":[],"bounds":{"document_bytes":16777216,"sheet_cells":100000,"rows_first":2000,"rows_last":500,"rows_between":2000,"halvings":0,"cell_chars":16384,"cell_head_chars":4096},"cells_cut":0,"cells_raw":0,"read":"whole","date_system":"1900"}

{"sheet":"Sheet1","index":0,"n_rows":19,"n_cols":11,"rows_kept":19,"cut":false,"hidden":false,"merged":[[18,0,18,2],[18,3,18,6],[18,7,18,10],[16,0,16,2],[16,3,16,6],[16,7,16,10],[17,0,17,2],[17,3,17,6],[17,7,17,10],[11,7,15,7],[11,8,15,8],[11,9,15,9],[11,10,15,10],[0,0,0,10],[1,0,1,10],[7,2,7,7],[7,8,7,10],[3,0,3,7],[5,3,5,5],[9,0,10,0],[9,1,9,2],[9,3,9,6],[9,7,9,10],[11,4,15,4]]}
["CRITICAL CONNECT"]
["Benefit Illustration in respect of policies offered on individual and family floater basis"]
["Plan","Plan A","Plan A Sub Option","9 CIs","Sum Insured",1000000,"Policy Tenure","1 year"]
["Plan B Sub Option"]
["Heart Protect","NA","Cancer Protect","NA","RenoLiv Protect","NA","Brain Protect","NA"]
["Otional Loan Protector Cover",null,"No","Optional Waiver for 30-Day Survival period",null,null,"Yes"]
["1st Adult Age",60,"2nd Adult Age",50,"1st Child Age",5,"2nd Child Age",10]
["3rd Child Age",25,"",null,null,null,null,null,"UIN: LIBHLIP21506V022021"]
[]
["Age of the members insured","Coverage opted on individual basis covering each member of the family separately (at a single point in time)",null,"Coverage opted on individual basis covering multiple members of the family under a single policy (Sum insured is available for each member of the family)",null,null,null,"Coverage opted on family floater basis with overall Sum insured (Only one sum insured is available for the entire family)"]
[null,"Premium (Rs.)","Sum insured (Rs.)","Premium (Rs.)","Discount, (if any)","Premium after discount (Rs.)","Sum insured (Rs.)","Premium or consolidated premium for all members of family (Rs.)","Floater discount, if any","Premium after discount (Rs.)","Sum insured"]
[{"$f":"IF(B7=\"\",0,B7)","v":60},{"$f":"IF($B$3=\"Plan A\",Master!AF5,Master!AG5)","v":26265.75},{"$f":"IF(B7=\"\",0,$F$3)","v":1000000},{"$f":"IF($B$3=\"Plan A\",Master!AF5,Master!AG5)","v":26265.75},{"$f":"IF(AND(COUNT(Master!R5:R9)>1,Sheet1!H3=\"1 year\"),\"Family Discount: 10%\",IF(AND(COUNT(Master!R5:R9)>1,Sheet1!H3=\"2 years\"),\"Family Discount: 10% & Long Term Discount: 7.5%\",IF(AND(COUNT(Master!R5:R9)>1,Sheet1!H3=\"3 years\"),\"Family Discount: 10% & Long Term Discount: 10%\",IF(AND(COUNT(Master!R5:R9)<=1,Sheet1!H3=\"2 years\"),\"Long Term Discount: 7.5%\",IF(AND(COUNT(Master!R5:R9)<=1,Sheet1!H3=\"3 years\"),\"Long Term Discount: 10%\",0%)))))","v":"Family Discount: 10%"},{"$f":"IF($B$3=\"Plan A\",Master!AI5,Master!AK5)","v":23639.174999999999},{"$f":"IF(B7=\"\",0,$F$3)","v":1000000},"Family Floater option not available in Critical  Connect","NA","NA","NA"]
[{"$f":"IF(D7=\"\",0,D7)","v":50},{"$f":"IF($B$3=\"Plan A\",Master!AF6,Master!AG6)","v":9551.85},{"$f":"IF(D7=\"\",0,$F$3)","v":1000000},{"$f":"IF($B$3=\"Plan A\",Master!AF6,Master!AG6)","v":9551.85},null,{"$f":"IF($B$3=\"Plan A\",Master!AI6,Master!AK6)","v":8596.6650000000009},{"$f":"IF(D7=\"\",0,$F$3)","v":1000000}]
[{"$f":"IF(F7=\"\",0,F7)","v":5},{"$f":"IF($B$3=\"Plan A\",Master!AF7,Master!AG7)","v":1314.6},{"$f":"IF(F7=\"\",0,$F$3)","v":1000000},{"$f":"IF($B$3=\"Plan A\",Master!AF7,Master!AG7)","v":1314.6},null,{"$f":"IF($B$3=\"Plan A\",Master!AI7,Master!AK7)","v":1183.1399999999999},{"$f":"IF(F7=\"\",0,$F$3)","v":1000000}]
[{"$f":"IF(H7=\"\",0,H7)","v":10},{"$f":"IF($B$3=\"Plan A\",Master!AF8,Master!AG8)","v":1314.6},{"$f":"IF(H7=\"\",0,$F$3)","v":1000000},{"$f":"IF($B$3=\"Plan A\",Master!AF8,Master!AG8)","v":1314.6},null,{"$f":"IF($B$3=\"Plan A\",Master!AI8,Master!AK8)","v":1183.1399999999999},{"$f":"IF(H7=\"\",0,$F$3)","v":1000000}]
[{"$f":"IF(B8=\"\",0,B8)","v":25},{"$f":"IF($B$3=\"Plan A\",Master!AF9,Master!AG9)","v":1314.6},{"$f":"IF(B8=\"\",0,$F$3)","v":1000000},{"$f":"IF($B$3=\"Plan A\",Master!AF9,Master!AG9)","v":1314.6},null,{"$f":"IF($B$3=\"Plan A\",Master!AI9,Master!AK9)","v":1183.1399999999999},{"$f":"IF(B8=\"\",0,$F$3)","v":1000000}]
[{"$f":"Master!AL5","v":"Total Premium for all members of the family is, Rs. 39761 (excluding GST) when each member is covered separately."},null,null,{"$f":"Master!AM5","v":"Total Premium for all members of the family is, Rs. 35785 (excluding GST)  when they are covered under a single policy"},null,null,null,"Total Premium when policy is opted on floater basis is, Rs. 0 (excluding GST)"]
[{"$f":"IF(H3=\"1 year\",\"\",\"*Total premium shown above includes long term discount\")","v":""},null,null,""]
[{"$f":"Master!AL6","v":"Sum insured available for each individual is Rs. 1000000"},null,null,{"$f":"Master!AM6","v":"Sum insured available for each family member is Rs. 1000000"},null,null,null,"Sum insured of Rs. 0 is available for the entire family."]

{"sheet":"Drop down lists","index":1,"n_rows":102,"n_cols":20,"rows_kept":102,"cut":false,"hidden":true,"merged":[]}
["Sum Insured","No. of Insured","No. of Children","Ind/Nominne Relationship","Plan","Plan A options","Plan B options",null,"Loading","Loading",null,null,"Nominee Relation","Occupation","Loan Tenure","Bank/Financier Name","Type of Loan","Applicant Status","Tenure","Age"]
[100000,0,0,"Self","Plan A","9 CIs","Heart Protect",null,0,"NA","Yes","Male","Self","Salaried","6 Months","HDFC Bank Ltd.","Home Loan","Borrower","1 year",5]
[200000,1,1,"Spouse","Plan B","25 CIs","Cancer Protect",null,0.05,null,"No","Female","Spouse","Housewife","9 Months","ICICI Bank","Loan Against Property","Co-Borrower","2 years",6]
[300000,2,2,"Son","Plan A&B","43 CIs","Renoliv Protect",null,0.1,null,null,null,"Son","Student","1 Year","Union Bank of India","Personal Loan",null,"3 years",7]
[400000,3,3,"Daughter",null,null,"Brain Protect",null,0.15,null,null,null,"Daughter","Retired","1.5 Years","AXIS Bank","Business Loan",null,null,8]
[500000,4,4,"Mother",null,null,null,null,0.2,null,null,null,"Mother","Others","2 Years","Kotak Bank","Gold Loan",null,null,9]
[600000,5,null,"Father",null,null,null,null,0.25,null,null,null,"Father",null,"3 Years",null,"Vehicle Loan",null,null,10]
[700000,null,null,"Brother",null,null,null,null,0.3,null,null,null,"Brother",null,"4 Years",null,"Education Loan",null,null,11]
[750000,null,null,"Sister",null,null,null,null,0.35,null,null,null,"Sister",null,"5 Years",null,"Balance Transfer Loan",null,null,12]
[800000,null,null,"Mother-in-Law",null,null,null,null,0.4,null,null,null,"Mother-in-Law",null,"6 Years",null,"Top Up Loan",null,null,13]
[900000,null,null,"Father-in-law",null,null,null,null,0.45,null,null,null,"Father-in-law",null,"7 Years",null,"Cash Credit Loan",null,null,14]
[1000000,null,null,"Son-in-law",null,null,null,null,0.5,null,null,null,"Son-in-law",null,"8 Years",null,"Agriculture Loan",null,null,15]
[1100000,null,null,"Daughter-in-law",null,null,null,null,0.6,null,null,null,"Daughter-in-law",null,"9 Years",null,"Loan Against Shares",null,null,16]
[1200000,null,null,"Grand-Mother",null,null,null,null,0.7,null,null,null,"Grand-Mother",null,"10 Years",null,"Consumer Loan",null,null,17]
[1300000,null,null,"Grand-Father",null,null,null,null,0.8,null,null,null,"Grand-Father",null,"11 Years",null,"Term Loan",null,null,18]
[1400000,null,null,"Grand Son",null,null,null,null,0.9,null,null,null,"Grand Son",null,"12 Years",null,"Project Finance Loan",null,null,19]
[1500000,null,null,"Grand Daughter",null,null,null,null,1,null,null,null,"Grand Daughter",null,"13 Years",null,"Land Purchase Loan",null,null,20]
[1600000,null,null,null,null,null,null,null,null,null,null,null,"Others",null,"14 Years",null,"Reverse Mortgage Loan",null,null,21]
[1700000,null,null,null,null,null,null,null,null,null,null,null,null,null,"15 Years",null,"Commercial Purchase Loan",null,null,22]
[1800000,null,null,null,null,null,null,null,null,null,null,null,null,null,"16 Years",null,"Loan for Repair & Extension",null,null,23]
[1900000,null,null,null,null,null,null,null,null,null,null,null,null,null,"17 Years",null,"Loan against earnest money deposits",null,null,24]
[2000000,null,null,null,null,null,null,null,null,null,null,null,null,null,"18 Years",null,"Corporate Finance Loans",null,null,25]
[2100000,null,null,null,null,null,null,null,null,null,null,null,null,null,"19 Years",null,"Microfinance",null,null,26]
[2200000,null,null,null,null,null,null,null,null,null,null,null,null,null,"20 Years",null,"Over Draft Loan",null,null,27]
[2300000,null,null,null,null,null,null,null,null,null,null,null,null,null,"21 Years",null,null,null,null,28]
[2400000,null,null,null,null,null,null,null,null,null,null,null,null,null,"22 Years",null,null,null,null,29]
[2500000,null,null,null,null,null,null,null,null,null,null,null,null,null,"23 Years",null,null,null,null,30]
[2600000,null,null,null,null,null,null,null,null,null,null,null,null,null,"24 Years",null,null,null,null,31]
[2700000,null,null,null,null,null,null,null,null,null,null,null,null,null,"25 Years",null,null,null,null,32]
[2800000,null,null,null,null,null,null,null,null,null,null,null,null,null,"26 Years",null,null,null,null,33]
[2900000,null,null,null,null,null,null,null,null,null,null,null,null,null,"27 Years",null,null,null,null,34]
[3000000,null,null,null,null,null,null,null,null,null,null,null,null,null,"28 Years",null,null,null,null,35]
[3100000,null,null,null,null,null,null,null,null,null,null,null,null,null,"29 Years",null,null,null,null,36]
[3200000,null,null,null,null,null,null,null,null,null,null,null,null,null,"30 Years",null,null,null,null,37]
[3300000,null,null,null,null,null,null,null,null,null,null,null,null,null,null,null,null,null,null,38]
[3400000,null,null,null,null,null,null,null,null,null,null,null,null,null,null,null,null,null,null,39]
[3500000,null,null,null,null,null,null,null,null,null,null,null,null,null,null,null,null,null,null,40]
[3600000,null,null,null,null,null,null,null,null,null,null,null,null,null,null,null,null,null,null,41]
[3700000,null,null,null,null,null,null,null,null,null,null,null,null,null,null,null,null,null,null,42]
[3800000,null,null,null,null,null,null,null,null,null,null,null,null,null,null,null,null,null,null,43]
[3900000,null,null,null,null,null,null,null,null,null,null,null,null,null,null,null,null,null,null,44]
[4000000,null,null,null,null,null,null,null,null,null,null,null,null,null,null,null,null,null,null,45]
[4100000,null,null,null,null,null,null,null,null,null,null,null,null,null,null,null,null,null,null,46]
[4200000,null,null,null,null,null,null,null,null,null,null,null,null,null,null,null,null,null,null,47]
[4300000,null,null,null,null,null,null,null,null,null,null,null,null,null,null,null,null,null,null,48]
[4400000,null,null,null,null,null,null,null,null,null,null,null,null,null,null,null,null,null,null,49]
[4500000,null,null,null,null,null,null,null,null,null,null,null,null,null,null,null,null,null,null,50]
[4600000,null,null,null,null,null,null,null,null,null,null,null,null,null,null,null,null,null,null,51]
[4700000,null,null,null,null,null,null,null,null,null,null,null,null,null,null,null,null,null,null,52]
[4800000,null,null,null,null,null,null,null,null,null,null,null,null,null,null,null,null,null,null,53]
[4900000,null,null,null,null,null,null,null,null,null,null,null,null,null,null,null,null,null,null,54]
[5000000,null,null,null,null,null,null,null,null,null,null,null,null,null,null,null,null,null,null,55]
[5100000,null,null,null,null,null,null,null,null,null,null,null,null,null,null,null,null,null,null,56]
[5200000,null,null,null,null,null,null,null,null,null,null,null,null,null,null,null,null,null,null,57]
[5300000,null,null,null,null,null,null,null,null,null,null,null,null,null,null,null,null,null,null,58]
[5400000,null,null,null,null,null,null,null,null,null,null,null,null,null,null,null,null,null,null,59]
[5500000,null,null,null,null,null,null,null,null,null,null,null,null,null,null,null,null,null,null,60]
[5600000,null,null,null,null,null,null,null,null,null,null,null,null,null,null,null,null,null,null,61]
[5700000,null,null,null,null,null,null,null,null,null,null,null,null,null,null,null,null,null,null,62]
[5800000,null,null,null,null,null,null,null,null,null,null,null,null,null,null,null,null,null,null,63]
[5900000,null,null,null,null,null,null,null,null,null,null,null,null,null,null,null,null,null,null,64]
[6000000,null,null,null,null,null,null,null,null,null,null,null,null,null,null,null,null,null,null,65]
[6100000]
[6200000]
[6300000]
[6400000]
[6500000]
[6600000]
[6700000]
[6800000]
[6900000]
[7000000]
[7100000]
[7200000]
[7300000]
[7400000]
[7500000]
[7600000]
[7700000]
[7800000]
[7900000]
[8000000]
[8100000]
[8200000]
[8300000]
[8400000]
[8500000]
[8600000]
[8700000]
[8800000]
[8900000]
[9000000]
[9100000]
[9200000]
[9300000]
[9400000]
[9500000]
[9600000]
[9700000]
[9800000]
[9900000]
[10000000]

{"sheet":"Master","index":2,"n_rows":1112,"n_cols":44,"rows_kept":1112,"cut":false,"hidden":true,"merged":[[38,34,38,35],[38,36,38,37],[12,34,12,35],[2,15,3,15],[2,16,3,16],[2,17,3,17],[2,18,3,18],[2,19,3,19],[2,21,3,21],[2,22,2,25],[2,26,2,27],[2,20,3,20]]}
["Sum Insured","Age Band ","SI&Age Band","9 CIs","25 CIs","43 CIs","Heart Protect","Cancer Protect","RenoLiv Protect","Brain Protect"]
[100000,"91 days - 25 years",{"$f":"B2&A2","v":"91 days - 25 years100000"},284,315,381,252,242,203,231,null,null,null,null,null,"Working"]
[100000,"26 years - 30 years",{"$f":"B3&A3","v":"26 years - 30 years100000"},323,350,421,276,260,207,242,null,null,null,"Age Band",null,"Sr. No.","Insured Name","Age","Age band","Sum insured","Match","Plan A Base Premium","Plan B",null,null,null,"Optional Cover"]
[100000,"31 years - 35 years","31 years - 35 years100000",422,450,563,386,297,216,265,null,0.25,25,"91 days - 25 years",null,null,null,null,null,null,null,null,{"$f":"IF(Sheet1!B5=\"Yes\",\"Heart Protect\",\"Heart Protect not opted\")","v":"Heart Protect not opted"},{"$f":"IF(Sheet1!D5=\"Yes\",\"Cancer Protect\",\"Cancer Protect not opted\")","v":"Cancer Protect not opted"},{"$f":"IF(Sheet1!$F$5=\"Yes\",\"RenoLiv Protect\",\"RenoLiv Protect not opted\")","v":"RenoLiv Protect not opted"},{"$f":"IF(Sheet1!$H$5=\"Yes\",\"Brain Protect\",\"Brain Protect not opted\")","v":"Brain Protect not opted"},"Loan Protector","30day Waiver","Total","Total with installment","Concat","Plan A Total","Plan B Total","Plan A with long term discount","Plan A with long term and Family discount","Plan B with long term discount","Plan B with long term and Family discount"]
[100000,"36 years - 40 years","36 years - 40 years100000",535,559,715,612,355,227,300,null,26,30,"26 years - 30 years",null,{"$f":"#REF!","v":{"$error":"#REF!"}},null,{"$f":"IF(Sheet1!B7=\"\",\"\",Sheet1!B7)","v":60},{"$f":"IFERROR(LOOKUP(R5,$L$4:$N$14),0)","v":"56 years - 60 years"},{"$f":"IF(R5=\"\",\"\",Sheet1!$F$3)","v":1000000},{"$f":"S5&T5","v":"56 years - 60 years1000000"},{"$f":"IF(OR(Sheet1!$B$3=\"Plan B\",Sheet1!$D$3=\"NA\",Sheet1!$D$3=\"Please Select\"),0,IF(Sheet1!$H$3=\"1 year\",IFERROR(INDEX(Master!$C$1:$J$1112,MATCH(Master!U5,Master!$C$1:$C$1112,0),MATCH(Sheet1!$D$3,Master!$C$1:$J$1,0)),0),IF(Sheet1!$H$3=\"2 years\",IFERROR(INDEX(Master!$C$1:$J$1112,MATCH(Master!U5,Master!$C$1:$C$1112,0),MATCH(Sheet1!$D$3,Master!$C$1:$J$1,0))*2,0),IFERROR(INDEX(Master!$C$1:$J$1112,MATCH(Master!U5,Master!$C$1:$C$1112,0),MATCH(Sheet1!$D$3,Master!$C$1:$J$1,0))*3,0))))","v":25015},{"$f":"IF(OR(Sheet1!$B$3=\"Plan A\",Sheet1!$B$5=\"NA\",Sheet1!$B$5=\"No\",Sheet1!$B$5=\"Please Select\"),0,IF(Sheet1!$H$3=\"1 year\",IFERROR(INDEX(Master!$C$1:$J$1112,MATCH(Master!U5,Master!$C$1:$C$1112,0),MATCH($W$4,Master!$C$1:$J$1,0)),0),IF(Sheet1!$H$3=\"2 years\",IFERROR(INDEX(Master!$C$1:$J$1112,MATCH(Master!U5,Master!$C$1:$C$1112,0),MATCH($W$4,Master!$C$1:$J$1,0))*2,0),IFERROR(INDEX(Master!$C$1:$J$1112,MATCH(Master!U5,Master!$C$1:$C$1112,0),MATCH($W$4,Master!$C$1:$J$1,0))*3,0))))","v":0},{"$f":"IF(OR(Sheet1!$B$3=\"Plan A\",Sheet1!$D$5=\"Please Select\",Sheet1!$D$5=\"NA\",Sheet1!$D$5=\"No\"),0,IF(Sheet1!$H$3=\"1 year\",IFERROR(INDEX(Master!$C$1:$J$1112,MATCH(Master!U5,Master!$C$1:$C$1112,0),MATCH($X$4,$C$1:$J$1,0)),0),IF(Sheet1!$H$3=\"2 years\",IFERROR(INDEX(Master!$C$1:$J$1112,MATCH(Master!U5,Master!$C$1:$C$1112,0),MATCH($X$4,$C$1:$J$1,0))*2,0),IFERROR(INDEX(Master!$C$1:$J$1112,MATCH(Master!U5,Master!$C$1:$C$1112,0),MATCH($X$4,$C$1:$J$1,0))*3,0))))","v":0},{"$f":"IF(OR(Sheet1!$B$3=\"Plan A\",Sheet1!$F$5=\"No\",Sheet1!$F$5=\"Please Select\",Sheet1!$F$5=\"NA\"),0,IF(Sheet1!$H$3=\"1 year\",IFERROR(INDEX(Master!$C$1:$J$1112,MATCH(Master!U5,Master!$C$1:$C$1112,0),MATCH($Y$4,Master!$C$1:$J$1,0)),0),IF(Sheet1!$H$3=\"2 years\",IFERROR(INDEX(Master!$C$1:$J$1112,MATCH(Master!U5,Master!$C$1:$C$1112,0),MATCH($Y$4,Master!$C$1:$J$1,0))*2,0),IFERROR(INDEX(Master!$C$1:$J$1112,MATCH(Master!U5,Master!$C$1:$C$1112,0),MATCH($Y$4,Master!$C$1:$J$1,0))*3,0))))","v":0},{"$f":"IF(OR(Sheet1!$B$3=\"Plan A\",Sheet1!$H$5=\"NA\",Sheet1!$H$5=\"No\",Sheet1!$H$5=\"Please Select\"),0,IF(Sheet1!$H$3=\"1 year\",IFERROR(INDEX(Master!$C$1:$J$1112,MATCH(Master!U5,Master!$C$1:$C$1112,0),MATCH($Z$4,Master!$C$1:$J$1,0)),0),IF(Sheet1!$H$3=\"2 years\",IFERROR(INDEX(Master!$C$1:$J$1112,MATCH(Master!U5,Master!$C$1:$C$1112,0),MATCH($Z$4,Master!$C$1:$J$1,0))*2,0),IFERROR(INDEX(Master!$C$1:$J$1112,MATCH(Master!U5,Master!$C$1:$C$1112,0),MATCH($Z$4,Master!$C$1:$J$1,0))*3,0))))","v":0},{"$f":"IF(OR(Sheet1!$C$6=\"No\",Sheet1!$C$6=\"Please Select\"),0,IF(Sheet1!$B$3=\"Plan A\",Master!V5*3%,IF(Sheet1!$B$3=\"Plan B\",SUM(W5:Z5)*3%,SUM(V5:Z5)*3%)))","v":0},{"$f":"IF(OR(Sheet1!$G$6=\"No\",Sheet1!$G$6=\"Please Select\"),0,IF(Sheet1!$B$3=\"Plan A\",Master!V5*5%,IF(Sheet1!$B$3=\"Plan B\",SUM(W5:Z5)*6%,(Master!V5*5%)+(SUM(W5:Z5)*6%))))","v":1250.75},{"$f":"IF(Sheet1!$B$3=\"Plan A\",V5+AA5+AB5,IF(Sheet1!$B$3=\"Plan B\",SUM(W5:AB5),SUM(V5:AB5)))","v":26265.75},null,null,{"$f":"IF(AND(Sheet1!$C$6=\"Yes\",Sheet1!$G$6=\"Yes\"),V5+((V5*3%)+(Master!V5*5%)),IF(AND(Sheet1!$C$6=\"Yes\",Sheet1!$G$6=\"No\"),V5+(V5*3%),IF(AND(Sheet1!$C$6=\"No\",Sheet1!$G$6=\"Yes\"),V5+(Master!V5*5%),V5)))","v":26265.75},{"$f":"IF(AND(Sheet1!$C$6=\"Yes\",Sheet1!$G$6=\"Yes\"),SUM(W5:Z5)+((SUM(W5:Z5)*3%)+(SUM(W5:Z5)*6%)),IF(AND(Sheet1!$C$6=\"Yes\",Sheet1!$G$6=\"No\"),SUM(W5:Z5)+(SUM(W5:Z5)*3%),IF(AND(Sheet1!$C$6=\"No\",Sheet1!$G$6=\"Yes\"),SUM(W5:Z5)+(SUM(W5:Z5)*6%),SUM(W5:Z5))))","v":0},{"$f":"AF5*(100%-$AM$17)","v":26265.75},{"$f":"AF5*(100%-$AM$16-$AM$17)","v":23639.174999999999},{"$f":"AG5*(100%-$AM$17)","v":0},{"$f":"AG5*(100%-$AM$16-$AM$17)","v":0},{"$f":"IF(Sheet1!B3=\"Plan A\",\"Total Premium for all members of the family is, Rs.\"&\" \"&ROUND(AH10,0)&\" \"&\"(excluding GST) when each member is covered separately.\",\"Total Premium for all members of the family is, Rs.\"&\" \"&ROUND(AJ10,0)&\" \"&\"(excluding GST) when each member is covered separately.\")","v":"Total Premium for all members of the family is, Rs. 39761 (excluding GST) when each member is covered separately."},{"$f":"IF(Sheet1!B3=\"Plan A\",\"Total Premium for all members of the family is, Rs.\"&\" \"&ROUND(Master!AI10,0)&\" \"&\"(excluding GST)  when they are covered under a single policy\",\"Total Premium for all members of the family is, Rs.\"&\" \"&ROUND(Master!AK10,0)&\" \"&\"(excluding GST)  when they are covered under a single policy\")","v":"Total Premium for all members of the family is, Rs. 35785 (excluding GST)  when they are covered under a single policy"}]
[100000,"41 years - 45 years","41 years - 45 years100000",837,865,1144,1070,461,245,354,null,31,35,"31 years - 35 years",null,{"$f":"#REF!","v":{"$error":"#REF!"}},null,{"$f":"IF(Sheet1!D7=\"\",\"\",Sheet1!D7)","v":50},{"$f":"IFERROR(LOOKUP(R6,$L$4:$N$14),0)","v":"46 years - 50 years"},{"$f":"IF(R6=\"\",\"\",Sheet1!$F$3)","v":1000000},{"$f":"IF(R6=\"\",\"\",S6&T6)","v":"46 years - 50 years1000000"},{"$f":"IF(OR(Sheet1!$B$3=\"Plan B\",Sheet1!$D$3=\"NA\",Sheet1!$D$3=\"Please Select\"),0,IF(Sheet1!$H$3=\"1 year\",IFERROR(INDEX(Master!$C$1:$J$1112,MATCH(Master!U6,Master!$C$1:$C$1112,0),MATCH(Sheet1!$D$3,Master!$C$1:$J$1,0)),0),IF(Sheet1!$H$3=\"2 years\",IFERROR(INDEX(Master!$C$1:$J$1112,MATCH(Master!U6,Master!$C$1:$C$1112,0),MATCH(Sheet1!$D$3,Master!$C$1:$J$1,0))*2,0),IFERROR(INDEX(Master!$C$1:$J$1112,MATCH(Master!U6,Master!$C$1:$C$1112,0),MATCH(Sheet1!$D$3,Master!$C$1:$J$1,0))*3,0))))","v":9097},{"$f":"IF(OR(Sheet1!$B$3=\"Plan A\",Sheet1!$B$5=\"NA\",Sheet1!$B$5=\"No\",Sheet1!$B$5=\"Please Select\"),0,IF(Sheet1!$H$3=\"1 year\",IFERROR(INDEX(Master!$C$1:$J$1112,MATCH(Master!U6,Master!$C$1:$C$1112,0),MATCH($W$4,Master!$C$1:$J$1,0)),0),IF(Sheet1!$H$3=\"2 years\",IFERROR(INDEX(Master!$C$1:$J$1112,MATCH(Master!U6,Master!$C$1:$C$1112,0),MATCH($W$4,Master!$C$1:$J$1,0))*2,0),IFERROR(INDEX(Master!$C$1:$J$1112,MATCH(Master!U6,Master!$C$1:$C$1112,0),MATCH($W$4,Master!$C$1:$J$1,0))*3,0))))","v":0},{"$f":"IF(OR(Sheet1!$B$3=\"Plan A\",Sheet1!$D$5=\"Please Select\",Sheet1!$D$5=\"NA\",Sheet1!$D$5=\"No\"),0,IF(Sheet1!$H$3=\"1 year\",IFERROR(INDEX(Master!$C$1:$J$1112,MATCH(Master!U6,Master!$C$1:$C$1112,0),MATCH($X$4,$C$1:$J$1,0)),0),IF(Sheet1!$H$3=\"2 years\",IFERROR(INDEX(Master!$C$1:$J$1112,MATCH(Master!U6,Master!$C$1:$C$1112,0),MATCH($X$4,$C$1:$J$1,0))*2,0),IFERROR(INDEX(Master!$C$1:$J$1112,MATCH(Master!U6,Master!$C$1:$C$1112,0),MATCH($X$4,$C$1:$J$1,0))*3,0))))","v":0},{"$f":"IF(OR(Sheet1!$B$3=\"Plan A\",Sheet1!$F$5=\"No\",Sheet1!$F$5=\"Please Select\",Sheet1!$F$5=\"NA\"),0,IF(Sheet1!$H$3=\"1 year\",IFERROR(INDEX(Master!$C$1:$J$1112,MATCH(Master!U6,Master!$C$1:$C$1112,0),MATCH($Y$4,Master!$C$1:$J$1,0)),0),IF(Sheet1!$H$3=\"2 years\",IFERROR(INDEX(Master!$C$1:$J$1112,MATCH(Master!U6,Master!$C$1:$C$1112,0),MATCH($Y$4,Master!$C$1:$J$1,0))*2,0),IFERROR(INDEX(Master!$C$1:$J$1112,MATCH(Master!U6,Master!$C$1:$C$1112,0),MATCH($Y$4,Master!$C$1:$J$1,0))*3,0))))","v":0},{"$f":"IF(OR(Sheet1!$B$3=\"Plan A\",Sheet1!$H$5=\"NA\",Sheet1!$H$5=\"No\",Sheet1!$H$5=\"Please Select\"),0,IF(Sheet1!$H$3=\"1 year\",IFERROR(INDEX(Master!$C$1:$J$1112,MATCH(Master!U6,Master!$C$1:$C$1112,0),MATCH($Z$4,Master!$C$1:$J$1,0)),0),IF(Sheet1!$H$3=\"2 years\",IFERROR(INDEX(Master!$C$1:$J$1112,MATCH(Master!U6,Master!$C$1:$C$1112,0),MATCH($Z$4,Master!$C$1:$J$1,0))*2,0),IFERROR(INDEX(Master!$C$1:$J$1112,MATCH(Master!U6,Master!$C$1:$C$1112,0),MATCH($Z$4,Master!$C$1:$J$1,0))*3,0))))","v":0},{"$f":"IF(OR(Sheet1!$C$6=\"No\",Sheet1!$C$6=\"Please Select\"),0,IF(Sheet1!$B$3=\"Plan A\",Master!V6*3%,IF(Sheet1!$B$3=\"Plan B\",SUM(W6:Z6)*3%,SUM(V6:Z6)*3%)))","v":0},{"$f":"IF(OR(Sheet1!$G$6=\"No\",Sheet1!$G$6=\"Please Select\"),0,IF(Sheet1!$B$3=\"Plan A\",Master!V6*5%,IF(Sheet1!$B$3=\"Plan B\",SUM(W6:Z6)*6%,(Master!V6*5%)+(SUM(W6:Z6)*6%))))","v":454.85},{"$f":"IF(Sheet1!$B$3=\"Plan A\",V6+AA6+AB6,IF(Sheet1!$B$3=\"Plan B\",SUM(W6:AB6),SUM(V6:AB6)))","v":9551.85},null,null,{"$f":"IF(AND(Sheet1!$C$6=\"Yes\",Sheet1!$G$6=\"Yes\"),V6+((V6*3%)+(Master!V6*5%)),IF(AND(Sheet1!$C$6=\"Yes\",Sheet1!$G$6=\"No\"),V6+(V6*3%),IF(AND(Sheet1!$C$6=\"No\",Sheet1!$G$6=\"Yes\"),V6+(Master!V6*5%),V6)))","v":9551.85},{"$f":"IF(AND(Sheet1!$C$6=\"Yes\",Sheet1!$G$6=\"Yes\"),SUM(W6:Z6)+((SUM(W6:Z6)*3%)+(SUM(W6:Z6)*6%)),IF(AND(Sheet1!$C$6=\"Yes\",Sheet1!$G$6=\"No\"),SUM(W6:Z6)+(SUM(W6:Z6)*3%),IF(AND(Sheet1!$C$6=\"No\",Sheet1!$G$6=\"Yes\"),SUM(W6:Z6)+(SUM(W6:Z6)*6%),SUM(W6:Z6))))","v":0},{"$f":"AF6*(100%-$AM$17)","v":9551.85},{"$f":"AF6*(100%-$AM$16-$AM$17)","v":8596.6650000000009},{"$f":"AG6*(100%-$AM$17)","v":0},{"$f":"AG6*(100%-$AM$16-$AM$17)","v":0},{"$f":"\"Sum insured available for each individual is Rs.\"&\" \"&Sheet1!F3","v":"Sum insured available for each individual is Rs. 1000000"},{"$f":"\"Sum insured available for each family member is Rs.\"&\" \"&Sheet1!F3","v":"Sum insured available for each family member is Rs. 1000000"}]
[100000,"46 years - 50 years","46 years - 50 years100000",1058,1177,2167,1679,649,267,434,null,36,40,"36 years - 40 years",null,{"$f":"#REF!","v":{"$error":"#REF!"}},null,{"$f":"IF(Sheet1!F7=\"\",\"\",Sheet1!F7)","v":5},"91 days - 25 years",{"$f":"IF(R7=\"\",\"\",Sheet1!$F$3)","v":1000000},{"$f":"IF(R7=\"\",\"\",S7&T7)","v":"91 days - 25 years1000000"},{"$f":"IF(OR(Sheet1!$B$3=\"Plan B\",Sheet1!$D$3=\"NA\",Sheet1!$D$3=\"Please Select\"),0,IF(Sheet1!$H$3=\"1 year\",IFERROR(INDEX(Master!$C$1:$J$1112,MATCH(Master!U7,Master!$C$1:$C$1112,0),MATCH(Sheet1!$D$3,Master!$C$1:$J$1,0)),0),IF(Sheet1!$H$3=\"2 years\",IFERROR(INDEX(Master!$C$1:$J$1112,MATCH(Master!U7,Master!$C$1:$C$1112,0),MATCH(Sheet1!$D$3,Master!$C$1:$J$1,0))*2,0),IFERROR(INDEX(Master!$C$1:$J$1112,MATCH(Master!U7,Master!$C$1:$C$1112,0),MATCH(Sheet1!$D$3,Master!$C$1:$J$1,0))*3,0))))","v":1252},{"$f":"IF(OR(Sheet1!$B$3=\"Plan A\",Sheet1!$B$5=\"NA\",Sheet1!$B$5=\"No\",Sheet1!$B$5=\"Please Select\"),0,IF(Sheet1!$H$3=\"1 year\",IFERROR(INDEX(Master!$C$1:$J$1112,MATCH(Master!U7,Master!$C$1:$C$1112,0),MATCH($W$4,Master!$C$1:$J$1,0)),0),IF(Sheet1!$H$3=\"2 years\",IFERROR(INDEX(Master!$C$1:$J$1112,MATCH(Master!U7,Master!$C$1:$C$1112,0),MATCH($W$4,Master!$C$1:$J$1,0))*2,0),IFERROR(INDEX(Master!$C$1:$J$1112,MATCH(Master!U7,Master!$C$1:$C$1112,0),MATCH($W$4,Master!$C$1:$J$1,0))*3,0))))","v":0},{"$f":"IF(OR(Sheet1!$B$3=\"Plan A\",Sheet1!$D$5=\"Please Select\",Sheet1!$D$5=\"NA\",Sheet1!$D$5=\"No\"),0,IF(Sheet1!$H$3=\"1 year\",IFERROR(INDEX(Master!$C$1:$J$1112,MATCH(Master!U7,Master!$C$1:$C$1112,0),MATCH($X$4,$C$1:$J$1,0)),0),IF(Sheet1!$H$3=\"2 years\",IFERROR(INDEX(Master!$C$1:$J$1112,MATCH(Master!U7,Master!$C$1:$C$1112,0),MATCH($X$4,$C$1:$J$1,0))*2,0),IFERROR(INDEX(Master!$C$1:$J$1112,MATCH(Master!U7,Master!$C$1:$C$1112,0),MATCH($X$4,$C$1:$J$1,0))*3,0))))","v":0},{"$f":"IF(OR(Sheet1!$B$3=\"Plan A\",Sheet1!$F$5=\"No\",Sheet1!$F$5=\"Please Select\",Sheet1!$F$5=\"NA\"),0,IF(Sheet1!$H$3=\"1 year\",IFERROR(INDEX(Master!$C$1:$J$1112,MATCH(Master!U7,Master!$C$1:$C$1112,0),MATCH($Y$4,Master!$C$1:$J$1,0)),0),IF(Sheet1!$H$3=\"2 years\",IFERROR(INDEX(Master!$C$1:$J$1112,MATCH(Master!U7,Master!$C$1:$C$1112,0),MATCH($Y$4,Master!$C$1:$J$1,0))*2,0),IFERROR(INDEX(Master!$C$1:$J$1112,MATCH(Master!U7,Master!$C$1:$C$1112,0),MATCH($Y$4,Master!$C$1:$J$1,0))*3,0))))","v":0},{"$f":"IF(OR(Sheet1!$B$3=\"Plan A\",Sheet1!$H$5=\"NA\",Sheet1!$H$5=\"No\",Sheet1!$H$5=\"Please Select\"),0,IF(Sheet1!$H$3=\"1 year\",IFERROR(INDEX(Master!$C$1:$J$1112,MATCH(Master!U7,Master!$C$1:$C$1112,0),MATCH($Z$4,Master!$C$1:$J$1,0)),0),IF(Sheet1!$H$3=\"2 years\",IFERROR(INDEX(Master!$C$1:$J$1112,MATCH(Master!U7,Master!$C$1:$C$1112,0),MATCH($Z$4,Master!$C$1:$J$1,0))*2,0),IFERROR(INDEX(Master!$C$1:$J$1112,MATCH(Master!U7,Master!$C$1:$C$1112,0),MATCH($Z$4,Master!$C$1:$J$1,0))*3,0))))","v":0},{"$f":"IF(OR(Sheet1!$C$6=\"No\",Sheet1!$C$6=\"Please Select\"),0,IF(Sheet1!$B$3=\"Plan A\",Master!V7*3%,IF(Sheet1!$B$3=\"Plan B\",SUM(W7:Z7)*3%,SUM(V7:Z7)*3%)))","v":0},{"$f":"IF(OR(Sheet1!$G$6=\"No\",Sheet1!$G$6=\"Please Select\"),0,IF(Sheet1!$B$3=\"Plan A\",Master!V7*5%,IF(Sheet1!$B$3=\"Plan B\",SUM(W7:Z7)*6%,(Master!V7*5%)+(SUM(W7:Z7)*6%))))","v":62.6},{"$f":"IF(Sheet1!$B$3=\"Plan A\",V7+AA7+AB7,IF(Sheet1!$B$3=\"Plan B\",SUM(W7:AB7),SUM(V7:AB7)))","v":1314.6},null,null,{"$f":"IF(AND(Sheet1!$C$6=\"Yes\",Sheet1!$G$6=\"Yes\"),V7+((V7*3%)+(Master!V7*5%)),IF(AND(Sheet1!$C$6=\"Yes\",Sheet1!$G$6=\"No\"),V7+(V7*3%),IF(AND(Sheet1!$C$6=\"No\",Sheet1!$G$6=\"Yes\"),V7+(Master!V7*5%),V7)))","v":1314.6},{"$f":"IF(AND(Sheet1!$C$6=\"Yes\",Sheet1!$G$6=\"Yes\"),SUM(W7:Z7)+((SUM(W7:Z7)*3%)+(SUM(W7:Z7)*6%)),IF(AND(Sheet1!$C$6=\"Yes\",Sheet1!$G$6=\"No\"),SUM(W7:Z7)+(SUM(W7:Z7)*3%),IF(AND(Sheet1!$C$6=\"No\",Sheet1!$G$6=\"Yes\"),SUM(W7:Z7)+(SUM(W7:Z7)*6%),SUM(W7:Z7))))","v":0},1314.6,1183.1399999999999,0,0]
[100000,"51 years - 55 years","51 years - 55 years100000",1829,2018,3533,2587,946,297,553,null,41,45,"41 years - 45 years",null,{"$f":"#REF!","v":{"$error":"#REF!"}},null,{"$f":"IF(Sheet1!H7=\"\",\"\",Sheet1!H7)","v":10},"91 days - 25 years",{"$f":"IF(R8=\"\",\"\",Sheet1!$F$3)","v":1000000},"91 days - 25 years1000000",{"$f":"IF(OR(Sheet1!$B$3=\"Plan B\",Sheet1!$D$3=\"NA\",Sheet1!$D$3=\"Please Select\"),0,IF(Sheet1!$H$3=\"1 year\",IFERROR(INDEX(Master!$C$1:$J$1112,MATCH(Master!U8,Master!$C$1:$C$1112,0),MATCH(Sheet1!$D$3,Master!$C$1:$J$1,0)),0),IF(Sheet1!$H$3=\"2 years\",IFERROR(INDEX(Master!$C$1:$J$1112,MATCH(Master!U8,Master!$C$1:$C$1112,0),MATCH(Sheet1!$D$3,Master!$C$1:$J$1,0))*2,0),IFERROR(INDEX(Master!$C$1:$J$1112,MATCH(Master!U8,Master!$C$1:$C$1112,0),MATCH(Sheet1!$D$3,Master!$C$1:$J$1,0))*3,0))))","v":1252},{"$f":"IF(OR(Sheet1!$B$3=\"Plan A\",Sheet1!$B$5=\"NA\",Sheet1!$B$5=\"No\",Sheet1!$B$5=\"Please Select\"),0,IF(Sheet1!$H$3=\"1 year\",IFERROR(INDEX(Master!$C$1:$J$1112,MATCH(Master!U8,Master!$C$1:$C$1112,0),MATCH($W$4,Master!$C$1:$J$1,0)),0),IF(Sheet1!$H$3=\"2 years\",IFERROR(INDEX(Master!$C$1:$J$1112,MATCH(Master!U8,Master!$C$1:$C$1112,0),MATCH($W$4,Master!$C$1:$J$1,0))*2,0),IFERROR(INDEX(Master!$C$1:$J$1112,MATCH(Master!U8,Master!$C$1:$C$1112,0),MATCH($W$4,Master!$C$1:$J$1,0))*3,0))))","v":0},{"$f":"IF(OR(Sheet1!$B$3=\"Plan A\",Sheet1!$D$5=\"Please Select\",Sheet1!$D$5=\"NA\",Sheet1!$D$5=\"No\"),0,IF(Sheet1!$H$3=\"1 year\",IFERROR(INDEX(Master!$C$1:$J$1112,MATCH(Master!U8,Master!$C$1:$C$1112,0),MATCH($X$4,$C$1:$J$1,0)),0),IF(Sheet1!$H$3=\"2 years\",IFERROR(INDEX(Master!$C$1:$J$1112,MATCH(Master!U8,Master!$C$1:$C$1112,0),MATCH($X$4,$C$1:$J$1,0))*2,0),IFERROR(INDEX(Master!$C$1:$J$1112,MATCH(Master!U8,Master!$C$1:$C$1112,0),MATCH($X$4,$C$1:$J$1,0))*3,0))))","v":0},{"$f":"IF(OR(Sheet1!$B$3=\"Plan A\",Sheet1!$F$5=\"No\",Sheet1!$F$5=\"Please Select\",Sheet1!$F$5=\"NA\"),0,IF(Sheet1!$H$3=\"1 year\",IFERROR(INDEX(Master!$C$1:$J$1112,MATCH(Master!U8,Master!$C$1:$C$1112,0),MATCH($Y$4,Master!$C$1:$J$1,0)),0),IF(Sheet1!$H$3=\"2 years\",IFERROR(INDEX(Master!$C$1:$J$1112,MATCH(Master!U8,Master!$C$1:$C$1112,0),MATCH($Y$4,Master!$C$1:$J$1,0))*2,0),IFERROR(INDEX(Master!$C$1:$J$1112,MATCH(Master!U8,Master!$C$1:$C$1112,0),MATCH($Y$4,Master!$C$1:$J$1,0))*3,0))))","v":0},{"$f":"IF(OR(Sheet1!$B$3=\"Plan A\",Sheet1!$H$5=\"NA\",Sheet1!$H$5=\"No\",Sheet1!$H$5=\"Please Select\"),0,IF(Sheet1!$H$3=\"1 year\",IFERROR(INDEX(Master!$C$1:$J$1112,MATCH(Master!U8,Master!$C$1:$C$1112,0),MATCH($Z$4,Master!$C$1:$J$1,0)),0),IF(Sheet1!$H$3=\"2 years\",IFERROR(INDEX(Master!$C$1:$J$1112,MATCH(Master!U8,Master!$C$1:$C$1112,0),MATCH($Z$4,Master!$C$1:$J$1,0))*2,0),IFERROR(INDEX(Master!$C$1:$J$1112,MATCH(Master!U8,Master!$C$1:$C$1112,0),MATCH($Z$4,Master!$C$1:$J$1,0))*3,0))))","v":0},{"$f":"IF(OR(Sheet1!$C$6=\"No\",Sheet1!$C$6=\"Please Select\"),0,IF(Sheet1!$B$3=\"Plan A\",Master!V8*3%,IF(Sheet1!$B$3=\"Plan B\",SUM(W8:Z8)*3%,SUM(V8:Z8)*3%)))","v":0},{"$f":"IF(OR(Sheet1!$G$6=\"No\",Sheet1!$G$6=\"Please Select\"),0,IF(Sheet1!$B$3=\"Plan A\",Master!V8*5%,IF(Sheet1!$B$3=\"Plan B\",SUM(W8:Z8)*6%,(Master!V8*5%)+(SUM(W8:Z8)*6%))))","v":62.6},{"$f":"IF(Sheet1!$B$3=\"Plan A\",V8+AA8+AB8,IF(Sheet1!$B$3=\"Plan B\",SUM(W8:AB8),SUM(V8:AB8)))","v":1314.6},null,null,{"$f":"IF(AND(Sheet1!$C$6=\"Yes\",Sheet1!$G$6=\"Yes\"),V8+((V8*3%)+(Master!V8*5%)),IF(AND(Sheet1!$C$6=\"Yes\",Sheet1!$G$6=\"No\"),V8+(V8*3%),IF(AND(Sheet1!$C$6=\"No\",Sheet1!$G$6=\"Yes\"),V8+(Master!V8*5%),V8)))","v":1314.6},{"$f":"IF(AND(Sheet1!$C$6=\"Yes\",Sheet1!$G$6=\"Yes\"),SUM(W8:Z8)+((SUM(W8:Z8)*3%)+(SUM(W8:Z8)*6%)),IF(AND(Sheet1!$C$6=\"Yes\",Sheet1!$G$6=\"No\"),SUM(W8:Z8)+(SUM(W8:Z8)*3%),IF(AND(Sheet1!$C$6=\"No\",Sheet1!$G$6=\"Yes\"),SUM(W8:Z8)+(SUM(W8:Z8)*6%),SUM(W8:Z8))))","v":0},1314.6,1183.1399999999999,0,0]
[100000,"56 years - 60 years","56 years - 60 years100000",2927,3299,5753,4613,1766,581,737,null,46,50,"46 years - 50 years",null,{"$f":"#REF!","v":{"$error":"#REF!"}},null,{"$f":"IF(Sheet1!B8=\"\",\"\",Sheet1!B8)","v":25},"91 days - 25 years",{"$f":"IF(R9=\"\",\"\",Sheet1!$F$3)","v":1000000},"91 days - 25 years1000000",{"$f":"IF(OR(Sheet1!$B$3=\"Plan B\",Sheet1!$D$3=\"NA\",Sheet1!$D$3=\"Please Select\"),0,IF(Sheet1!$H$3=\"1 year\",IFERROR(INDEX(Master!$C$1:$J$1112,MATCH(Master!U9,Master!$C$1:$C$1112,0),MATCH(Sheet1!$D$3,Master!$C$1:$J$1,0)),0),IF(Sheet1!$H$3=\"2 years\",IFERROR(INDEX(Master!$C$1:$J$1112,MATCH(Master!U9,Master!$C$1:$C$1112,0),MATCH(Sheet1!$D$3,Master!$C$1:$J$1,0))*2,0),IFERROR(INDEX(Master!$C$1:$J$1112,MATCH(Master!U9,Master!$C$1:$C$1112,0),MATCH(Sheet1!$D$3,Master!$C$1:$J$1,0))*3,0))))","v":1252},{"$f":"IF(OR(Sheet1!$B$3=\"Plan A\",Sheet1!$B$5=\"NA\",Sheet1!$B$5=\"No\",Sheet1!$B$5=\"Please Select\"),0,IF(Sheet1!$H$3=\"1 year\",IFERROR(INDEX(Master!$C$1:$J$1112,MATCH(Master!U9,Master!$C$1:$C$1112,0),MATCH($W$4,Master!$C$1:$J$1,0)),0),IF(Sheet1!$H$3=\"2 years\",IFERROR(INDEX(Master!$C$1:$J$1112,MATCH(Master!U9,Master!$C$1:$C$1112,0),MATCH($W$4,Master!$C$1:$J$1,0))*2,0),IFERROR(INDEX(Master!$C$1:$J$1112,MATCH(Master!U9,Master!$C$1:$C$1112,0),MATCH($W$4,Master!$C$1:$J$1,0))*3,0))))","v":0},{"$f":"IF(OR(Sheet1!$B$3=\"Plan A\",Sheet1!$D$5=\"Please Select\",Sheet1!$D$5=\"NA\",Sheet1!$D$5=\"No\"),0,IF(Sheet1!$H$3=\"1 year\",IFERROR(INDEX(Master!$C$1:$J$1112,MATCH(Master!U9,Master!$C$1:$C$1112,0),MATCH($X$4,$C$1:$J$1,0)),0),IF(Sheet1!$H$3=\"2 years\",IFERROR(INDEX(Master!$C$1:$J$1112,MATCH(Master!U9,Master!$C$1:$C$1112,0),MATCH($X$4,$C$1:$J$1,0))*2,0),IFERROR(INDEX(Master!$C$1:$J$1112,MATCH(Master!U9,Master!$C$1:$C$1112,0),MATCH($X$4,$C$1:$J$1,0))*3,0))))","v":0},{"$f":"IF(OR(Sheet1!$B$3=\"Plan A\",Sheet1!$F$5=\"No\",Sheet1!$F$5=\"Please Select\",Sheet1!$F$5=\"NA\"),0,IF(Sheet1!$H$3=\"1 year\",IFERROR(INDEX(Master!$C$1:$J$1112,MATCH(Master!U9,Master!$C$1:$C$1112,0),MATCH($Y$4,Master!$C$1:$J$1,0)),0),IF(Sheet1!$H$3=\"2 years\",IFERROR(INDEX(Master!$C$1:$J$1112,MATCH(Master!U9,Master!$C$1:$C$1112,0),MATCH($Y$4,Master!$C$1:$J$1,0))*2,0),IFERROR(INDEX(Master!$C$1:$J$1112,MATCH(Master!U9,Master!$C$1:$C$1112,0),MATCH($Y$4,Master!$C$1:$J$1,0))*3,0))))","v":0},{"$f":"IF(OR(Sheet1!$B$3=\"Plan A\",Sheet1!$H$5=\"NA\",Sheet1!$H$5=\"No\",Sheet1!$H$5=\"Please Select\"),0,IF(Sheet1!$H$3=\"1 year\",IFERROR(INDEX(Master!$C$1:$J$1112,MATCH(Master!U9,Master!$C$1:$C$1112,0),MATCH($Z$4,Master!$C$1:$J$1,0)),0),IF(Sheet1!$H$3=\"2 years\",IFERROR(INDEX(Master!$C$1:$J$1112,MATCH(Master!U9,Master!$C$1:$C$1112,0),MATCH($Z$4,Master!$C$1:$J$1,0))*2,0),IFERROR(INDEX(Master!$C$1:$J$1112,MATCH(Master!U9,Master!$C$1:$C$1112,0),MATCH($Z$4,Master!$C$1:$J$1,0))*3,0))))","v":0},{"$f":"IF(OR(Sheet1!$C$6=\"No\",Sheet1!$C$6=\"Please Select\"),0,IF(Sheet1!$B$3=\"Plan A\",Master!V9*3%,IF(Sheet1!$B$3=\"Plan B\",SUM(W9:Z9)*3%,SUM(V9:Z9)*3%)))","v":0},{"$f":"IF(OR(Sheet1!$G$6=\"No\",Sheet1!$G$6=\"Please Select\"),0,IF(Sheet1!$B$3=\"Plan A\",Master!V9*5%,IF(Sheet1!$B$3=\"Plan B\",SUM(W9:Z9)*6%,(Master!V9*5%)+(SUM(W9:Z9)*6%))))","v":62.6},{"$f":"IF(Sheet1!$B$3=\"Plan A\",V9+AA9+AB9,IF(Sheet1!$B$3=\"Plan B\",SUM(W9:AB9),SUM(V9:AB9)))","v":1314.6},null,null,{"$f":"IF(AND(Sheet1!$C$6=\"Yes\",Sheet1!$G$6=\"Yes\"),V9+((V9*3%)+(Master!V9*5%)),IF(AND(Sheet1!$C$6=\"Yes\",Sheet1!$G$6=\"No\"),V9+(V9*3%),IF(AND(Sheet1!$C$6=\"No\",Sheet1!$G$6=\"Yes\"),V9+(Master!V9*5%),V9)))","v":1314.6},{"$f":"IF(AND(Sheet1!$C$6=\"Yes\",Sheet1!$G$6=\"Yes\"),SUM(W9:Z9)+((SUM(W9:Z9)*3%)+(SUM(W9:Z9)*6%)),IF(AND(Sheet1!$C$6=\"Yes\",Sheet1!$G$6=\"No\"),SUM(W9:Z9)+(SUM(W9:Z9)*3%),IF(AND(Sheet1!$C$6=\"No\",Sheet1!$G$6=\"Yes\"),SUM(W9:Z9)+(SUM(W9:Z9)*6%),SUM(W9:Z9))))","v":0},1314.6,1183.1399999999999,0,0]
[100000,"61 years - 65 years","61 years - 65 years100000",3946,4568,8948,6054,2574,680,1129,null,51,55,"51 years - 55 years",null,null,null,null,null,"Total (Individual)",null,{"$f":"SUM(V5:V9)","v":37868},null,null,null,null,null,null,{"$f":"SUM(AC5:AC9)","v":39761.399999999994},null,null,{"$f":"SUM(AF5:AF9)","v":39761.399999999994},0,39761.399999999994,35785.26,0,0]
[100000,"66 years - 70 years","66 years - 70 years100000",5027,6018,11756,7367,3233,773,1576,null,56,60,"56 years - 60 years","Months"]
[100000,"More than 70 years","More than 70 years100000",11202,13419,24665,13494,6566,1509,4247,null,61,65,"61 years - 65 years","Years",null,null,null,null,null,null,null,{"$f":"W5/2","v":0},{"$f":"X5/2","v":0},0,0]
[200000,"91 days - 25 years","91 days - 25 years200000",391,453,585,327,308,229,285,null,66,70,"66 years - 70 years",null,null,null,null,null,null,null,null,{"$f":"W6/2","v":0},0,0,0]
[200000,"26 years - 30 years","26 years - 30 years200000",470,524,667,375,343,237,307,null,71,100,"More than 70 years",null,null,null,null,null,null,null,null,null,null,null,null,null,null,null,"Plan A","Plan B",null,null,null,null,null,null,null,null,"Plan A","Plan B","Plan A&B",null,"Plan A +B Total"]
[200000,"31 years - 35 years","31 years - 35 years200000",668,725,950,596,417,255,355,null,null,null,null,null,null,null,null,null,null,null,null,null,null,{"$f":"IF(#REF!=\"2 Years\",IFERROR(INDEX(Master!$C$1:$J$1112,MATCH(Master!U6,Master!$C$1:$C$1112,0),MATCH($Y$4,Master!$C$1:$J$1,0))*2,0))","v":{"$error":"#REF!"}},null,null,null,null,null,null,null,null,null,null,null,null,"Basic Premium",null,{"$f":"AF10","v":39761.399999999994},{"$f":"AG10","v":0},{"$f":"IF(#REF!=\"Individual\",Master!$AC$10,Master!$AC$11)","v":{"$error":"#REF!"}},null,{"$f":"AN15+AO15","v":39761.399999999994}]
[200000,"36 years - 40 years","36 years - 40 years200000",892,942,1254,1047,534,278,424,null,null,null,null,null,null,null,null,null,null,null,null,null,null,null,null,null,null,null,null,null,null,null,null,null,null,null,"Family Discount",{"$f":"IF(COUNT(R5:R9)>1,10%,0%)","v":0.1},{"$f":"IF(COUNT(R5:R9)>1,(-(10%*AN15)),0)","v":-3976.1399999999994},{"$f":"IF(COUNT(R5:R9)>1,(-(10%*AO15)),0)","v":0},{"$f":"IF(AND(#REF!=\"Individual\",#REF!>1,COUNT(#REF!)=#REF!),(-(10%*AP15)),0)","v":{"$error":"#REF!"}},null,-3976.1399999999994]
[200000,"41 years - 45 years","41 years - 45 years200000",1498,1554,2113,1964,746,313,532,null,null,null,null,null,null,null,null,null,null,null,null,null,null,null,null,null,null,null,null,null,null,null,null,null,null,null,"Long term discount",{"$f":"IF(Sheet1!$H$3=\"2 years\",\"7.5%\",IF(Sheet1!$H$3=\"3 years\",\"10%\",0%))","v":0},{"$f":"-(AN15*AM17)","v":0},{"$f":"-(AO15*AM17)","v":0},{"$f":"-(AP15*AM17)","v":{"$error":"#REF!"}},null,0]
[200000,"46 years - 50 years","46 years - 50 years200000",1938,2178,4159,3181,1121,358,691,null,null,null,null,null,null,null,null,null,null,null,null,null,null,null,null,null,null,null,null,null,null,null,null,null,null,null,"Employee Discount",0,{"$f":"-(AN15*AM18)","v":0},{"$f":"-(AO15*AM18)","v":0},{"$f":"-(AP15*AM18)","v":{"$error":"#REF!"}},null,0]
[200000,"51 years - 55 years","51 years - 55 years200000",3186,3565,6596,4822,1714,418,929,null,null,null,null,null,null,null,null,null,null,null,null,null,null,null,null,null,null,null,null,null,null,null,null,null,null,null,"Substandard Loading",null,0,0,{"$f":"#REF!","v":{"$error":"#REF!"}},null,0]
[200000,"56 years - 60 years","56 years - 60 years200000",5382,6125,11032,8711,2971,749,1297,null,null,null,null,null,null,null,null,null,null,null,null,null,null,null,null,null,null,null,null,null,null,null,null,null,null,null,"Net Premium wo installment",null,{"$f":"SUM(AN15:AN19)","v":35785.259999999995},{"$f":"SUM(AO15:AO19)","v":0},{"$f":"SUM(AP15:AP19)","v":{"$error":"#REF!"}},null,35785.259999999995]
[200000,"61 years - 65 years","61 years - 65 years200000",7416,8659,17420,11582,4579,944,2080]
[200000,"66 years - 70 years","66 years - 70 years200000",9573,11555,23030,14198,5890,1128,2973]
[200000,"More than 70 years","More than 70 years200000",21908,26341,48837,26408,12525,2587,8309]
[300000,"91 days - 25 years","91 days - 25 years300000",499,591,789,402,373,256,340]
[300000,"26 years - 30 years","26 years - 30 years300000",616,697,912,474,427,268,372]
[300000,"31 years - 35 years","31 years - 35 years300000",914,999,1337,806,537,294,444]
[300000,"36 years - 40 years","36 years - 40 years300000",1250,1325,1793,1482,713,329,547]
[300000,"41 years - 45 years","41 years - 45 years300000",2159,2243,3081,2857,1031,381,709]
[300000,"46 years - 50 years","46 years - 50 years300000",2819,3179,6150,4683,1593,449,948]
[300000,"51 years - 55 years","51 years - 55 years300000",4544,5112,9657,7056,2482,538,1304]
[300000,"56 years - 60 years","56 years - 60 years300000",7836,8951,16311,12808,4176,918,1856]
[300000,"61 years - 65 years","61 years - 65 years300000",10885,12751,25890,17110,6584,1209,3030,null,null,null,null,null,null,null,null,null,null,null,null,null,null,null,null,null,null,null,null,null,"Installment Calculation"]
[300000,"66 years - 70 years","66 years - 70 years300000",14119,17092,34303,21029,8547,1483,4369,null,null,null,null,null,null,null,null,null,null,null,null,null,null,null,null,null,null,null,null,null,"Installment Frequency","Loading on Annual Premium"]
[300000,"More than 70 years","More than 70 years300000",32614,39264,73009,39321,18484,3665,12371,null,null,null,null,null,null,null,null,null,null,null,null,null,null,null,null,null,null,null,"No",null,"No",0]
[400000,"91 days - 25 years","91 days - 25 years400000",607,729,993,477,439,282,394,null,null,null,null,null,null,null,null,null,null,null,null,null,null,null,null,null,null,null,"Half_Yearly",null,"Half_Yearly",0.02]
[400000,"26 years - 30 years","26 years - 30 years400000",763,871,1158,573,510,298,438,null,null,null,null,null,null,null,null,null,null,null,null,null,null,null,null,null,null,null,"Quarterly",null,"Quarterly",0.04]
[400000,"31 years - 35 years","31 years - 35 years400000",1160,1273,1723,1016,657,333,533,null,null,null,null,null,null,null,null,null,null,null,null,null,null,null,null,null,null,null,"Monthly",null,"Monthly",0.05]
[400000,"36 years - 40 years","36 years - 40 years400000",1608,1707,2332,1917,892,380,670]
[400000,"41 years - 45 years","41 years - 45 years400000",2819,2932,4049,3751,1315,448,887,null,null,null,null,null,null,null,null,null,null,null,null,null,null,null,null,null,null,null,null,null,"Option Loading",{"$f":"IFERROR(VLOOKUP(#REF!,Master!$AF$33:$AG$37,2,0),0)","v":0},null,"Plan A",null,"Plan B",null,"TotalA+B"]
[400000,"46 years - 50 years","46 years - 50 years400000",3700,4180,8141,6185,2065,539,1205,null,null,null,null,null,null,null,null,null,null,null,null,null,null,null,null,null,null,null,null,null,null,"Loading amt","Premium with loading","LoadingAmt","Prm with Loading","LoadingAmt","Prm with Loading"]
[400000,"51 years - 55 years","51 years - 55 years400000",5901,6659,12719,9291,3250,658,1680,null,null,null,null,null,null,null,null,null,null,null,null,null,null,null,null,null,null,null,null,null,"Individual",{"$f":"$AG$39*$AP$20","v":{"$error":"#REF!"}},{"$f":"$AG$41+$AP$20","v":{"$error":"#REF!"}},{"$f":"$AG$39*$AN$20","v":0},{"$f":"$AI$41+$AN$20","v":35785.259999999995},{"$f":"$AG$39*$AO$20","v":0},{"$f":"$AK$41+$AO$20","v":0},{"$f":"AL41+AJ41","v":35785.259999999995}]
[400000,"56 years - 60 years","56 years - 60 years400000",10290,11776,21590,16905,5381,1086,2415,null,null,null,null,null,null,null,null,null,null,null,null,null,null,null,null,null,null,null,null,null,"FF",{"$f":"$AG$39*$AP$20","v":{"$error":"#REF!"}},{"$f":"$AG$42+AP20","v":{"$error":"#REF!"}},{"$f":"$AG$39*$AN$20","v":0},{"$f":"$AI$41+$AN$20","v":35785.259999999995},{"$f":"$AG$39*$AO$20","v":0},{"$f":"$AK$41+$AO$20","v":0},{"$f":"AL42+AJ42","v":35785.259999999995}]
[400000,"61 years - 65 years","61 years - 65 years400000",14355,16842,34361,22638,8590,1474,3980]
[400000,"66 years - 70 years","66 years - 70 years400000",18666,22628,45577,27860,11204,1838,5765]
[400000,"More than 70 years","More than 70 years400000",43320,52187,97181,52234,24443,4744,16433]
[500000,"91 days - 25 years","91 days - 25 years500000",714,867,1197,552,504,319,449]
[500000,"26 years - 30 years","26 years - 30 years500000",910,1045,1403,673,593,329,503]
[500000,"31 years - 35 years","31 years - 35 years500000",1406,1547,2110,1226,777,372,621]
[500000,"36 years - 40 years","36 years - 40 years500000",1966,2090,2871,2353,1071,431,794]
[500000,"41 years - 45 years","41 years - 45 years500000",3480,3621,5017,4644,1600,516,1064]
[500000,"46 years - 50 years","46 years - 50 years500000",4581,5181,10133,7686,2537,630,1462]
[500000,"51 years - 55 years","51 years - 55 years500000",7259,8206,15781,11525,4018,778,2056]
[500000,"56 years - 60 years","56 years - 60 years500000",12745,14602,26869,21003,6586,1255,2974]
[500000,"61 years - 65 years","61 years - 65 years500000",17824,20933,42831,28165,10595,1738,4930]
[500000,"66 years - 70 years","66 years - 70 years500000",23212,28165,56850,34692,13861,2193,7161]
[500000,"More than 70 years","More than 70 years500000",54026,65110,121353,65147,30402,5822,20495]
[600000,"91 days - 25 years","91 days - 25 years600000",822,1005,1401,627,570,336,503]
[600000,"26 years - 30 years","26 years - 30 years600000",1056,1218,1649,772,677,359,568]
[600000,"31 years - 35 years","31 years - 35 years600000",1652,1821,2497,1435,898,411,710]
[600000,"36 years - 40 years","36 years - 40 years600000",2324,2473,3410,2788,1249,482,917]
[600000,"41 years - 45 years","41 years - 45 years600000",4141,4310,5985,5538,1885,584,1242]
[600000,"46 years - 50 years","46 years - 50 years600000",5575,6296,12238,9361,3009,720,1719]
[600000,"51 years - 55 years","51 years - 55 years600000",8616,9753,18843,13760,4786,898,2431]
[600000,"56 years - 60 years","56 years - 60 years600000",15199,17428,32148,25100,7790,1423,3534]
[600000,"61 years - 65 years","61 years - 65 years600000",21293,25025,51302,33693,12600,2003,5881]
[600000,"66 years - 70 years","66 years - 70 years600000",27758,33702,68124,41523,16518,2548,8557]
[600000,"More than 70 years",{"$f":"B67&A67","v":"More than 70 years600000"},64732,78033,145526,78060,36362,6900,24556]
[700000,"91 days - 25 years","91 days - 25 years700000",929,1144,1605,703,636,362,557]
[700000,"26 years - 30 years","26 years - 30 years700000",1203,1392,1894,871,760,390,633]
[700000,"31 years - 35 years","31 years - 35 years700000",1898,2095,2883,1645,1018,450,799]
[700000,"36 years - 40 years","36 years - 40 years700000",2682,2855,3949,3223,1428,533,1041]
[700000,"41 years - 45 years","41 years - 45 years700000",4802,4999,6954,6432,2169,652,1420]
[700000,"46 years - 50 years","46 years - 50 years700000",6456,7297,14229,10863,3481,811,1976]
[700000,"51 years - 55 years","51 years - 55 years700000",9974,11300,21905,15995,5555,1018,2807]
[700000,"56 years - 60 years","56 years - 60 years700000",17653,20253,37427,29197,8995,1592,4093]
[700000,"61 years - 65 years","61 years - 65 years700000",24763,29116,59772,39221,14605,2268,6831]
[700000,"66 years - 70 years","66 years - 70 years700000",32304,39239,79398,48354,19175,2903,9953]
[700000,"More than 70 years","More than 70 years700000",75437,90956,169698,90973,42321,7979,28618]
[750000,"91 days - 25 years","91 days - 25 years750000",983,1213,1707,740,668,375,585]
[750000,"26 years - 30 years","26 years - 30 years750000",1276,1479,2017,921,802,405,666]
[750000,"31 years - 35 years","31 years - 35 years750000",2021,2232,3077,1750,1078,470,844]
[750000,"36 years - 40 years","36 years - 40 years750000",2861,3047,4219,3441,1518,559,1103]
[750000,"41 years - 45 years","41 years - 45 years750000",5132,5344,7438,6878,2311,686,1508]
[750000,"46 years - 50 years","46 years - 50 years750000",6896,7797,15224,11614,3717,856,2105]
[750000,"51 years - 55 years","51 years - 55 years750000",10652,12074,23436,17112,5939,1078,2995]
[750000,"56 years - 60 years","56 years - 60 years750000",18880,21666,40066,31246,9597,1676,4373]
[750000,"61 years - 65 years","61 years - 65 years750000",26498,31162,64007,41985,15608,2400,7306]
[750000,"66 years - 70 years","66 years - 70 years750000",34577,42008,85034,51770,20503,3080,10651]
[750000,"More than 70 years","More than 70 years750000",80790,97417,181783,97429,45300,8518,30649]
[800000,"91 days - 25 years","91 days - 25 years800000",1037,1282,1809,778,701,389,612]
[800000,"26 years - 30 years","26 years - 30 years800000",1349,1566,2139,970,843,420,698]
[800000,"31 years - 35 years","31 years - 35 years800000",2144,2369,3270,1855,1138,489,888]
[800000,"36 years - 40 years","36 years - 40 years800000",3039,3238,4488,3658,1607,584,1164]
[800000,"41 years - 45 years","41 years - 45 years800000",5463,5689,7922,7325,2454,720,1597]
[800000,"46 years - 50 years","46 years - 50 years800000",7336,8298,16220,12365,3953,901,2233]
[800000,"51 years - 55 years","51 years - 55 years800000",11331,12848,24967,18229,6323,1138,3183]
[800000,"56 years - 60 years","56 years - 60 years800000",20107,23079,42705,33295,10200,1760,4652]
[800000,"61 years - 65 years","61 years - 65 years800000",28232,33207,68243,44749,16610,2532,7781]
[800000,"66 years - 70 years","66 years - 70 years800000",36851,44776,90671,55185,21832,3258,11349]
[800000,"More than 70 years","More than 70 years800000",86143,103879,193869,103886,48280,9057,32680]
[900000,"91 days - 25 years","91 days - 25 years900000",1144,1420,2014,853,767,415,666]
[900000,"26 years - 30 years","26 years - 30 years900000",1496,1739,2385,1070,927,450,764]
[900000,"31 years - 35 years","31 years - 35 years900000",2390,2643,3657,2065,1258,529,977]
[900000,"36 years - 40 years","36 years - 40 years900000",3397,3621,5027,4093,1786,635,1288]
[900000,"41 years - 45 years","41 years - 45 years900000",6123,6378,8890,8219,2738,788,1775]
[900000,"46 years - 50 years","46 years - 50 years900000",8217,9299,18211,13867,4425,992,2490]
[900000,"51 years - 55 years","51 years - 55 years900000",12688,14395,28029,20464,7091,1258,3558]
[900000,"56 years - 60 years","56 years - 60 years900000",22561,25904,47984,37392,11405,1928,5211]
[900000,"61 years - 65 years","61 years - 65 years900000",31702,37298,76713,50277,18615,2797,8731]
[900000,"66 years - 70 years","66 years - 70 years900000",41397,50313,101945,62016,24489,3613,12746]
[900000,"More than 70 years","More than 70 years900000",96849,116802,218041,116799,54239,10135,36742]
[1000000,"91 days - 25 years","91 days - 25 years1000000",1252,1558,2218,928,833,441,720]
[1000000,"26 years - 30 years","26 years - 30 years1000000",1642,1913,2628,1169,1009,481,829]
[1000000,"31 years - 35 years","31 years - 35 years1000000",2636,2917,4043,2275,1378,567,1066]
[1000000,"36 years - 40 years","36 years - 40 years1000000",3755,4002,5564,4528,1964,685,1411]
[1000000,"41 years - 45 years","41 years - 45 years1000000",6784,7066,9858,9111,3023,856,1951]
[1000000,"46 years - 50 years","46 years - 50 years1000000",9097,10299,20195,15368,4896,1082,2746]
[1000000,"51 years - 55 years","51 years - 55 years1000000",14046,15938,31082,22699,7857,1378,3934]
[1000000,"56 years - 60 years","56 years - 60 years1000000",25015,28729,53263,41489,12608,2096,5770]
[1000000,"61 years - 65 years","61 years - 65 years1000000",35172,41389,85172,55803,20618,3062,9679]
[1000000,"66 years - 70 years","66 years - 70 years1000000",45943,55850,113219,68848,27146,3967,14141]
[1000000,"More than 70 years","More than 70 years1000000",107555,129725,242213,129712,60197,11214,40803]
[1100000,"91 days - 25 years","91 days - 25 years1100000",1359,1696,2422,1003,898,468,775]
[1100000,"26 years - 30 years","26 years - 30 years1100000",1789,2087,2875,1268,1093,511,894]
[1100000,"31 years - 35 years","31 years - 35 years1100000",2882,3191,4430,2485,1498,607,1155]
[1100000,"36 years - 40 years","36 years - 40 years1100000",4113,4386,6106,4964,2143,737,1535]
[1100000,"41 years - 45 years","41 years - 45 years1100000",7445,7756,10826,10006,3308,924,2130]
[1100000,"46 years - 50 years","46 years - 50 years1100000",9979,11300,22194,16870,5369,1173,3004]
[1100000,"51 years - 55 years","51 years - 55 years1100000",15668,17753,34418,24933,8627,1498,4310]
[1100000,"56 years - 60 years","56 years - 60 years1100000",27736,31822,58810,45587,13814,2265,6330]
[1100000,"61 years - 65 years",{"$f":"B131&A131","v":"61 years - 65 years1100000"},38910,45751,93927,61333,22626,3326,10632]
[1100000,"66 years - 70 years","66 years - 70 years1100000",50762,61660,124769,75679,29803,4322,15538]
[1100000,"More than 70 years","More than 70 years1100000",118547,142935,266677,142625,66157,12292,44865]
[1200000,"91 days - 25 years","91 days - 25 years1200000",1467,1835,2626,1078,964,495,829]
[1200000,"26 years - 30 years","26 years - 30 years1200000",1936,2260,3121,1367,1177,542,959]
[1200000,"31 years - 35 years","31 years - 35 years1200000",3128,3466,4817,2694,1619,646,1244]
[1200000,"36 years - 40 years","36 years - 40 years1200000",4471,4769,6645,5399,2322,788,1658]
[1200000,"41 years - 45 years","41 years - 45 years1200000",8106,8445,11794,10899,3592,992,2307]
[1200000,"46 years - 50 years","46 years - 50 years1200000",10860,12301,24185,18372,5841,1264,3261]
[1200000,"51 years - 55 years","51 years - 55 years1200000",17025,19300,37480,27168,9395,1618,4685]
[1200000,"56 years - 60 years","56 years - 60 years1200000",30190,34648,64089,49684,15019,2434,6889]
[1200000,"61 years - 65 years","61 years - 65 years1200000",42379,49842,102397,66861,24631,3591,11582]
[1200000,"66 years - 70 years","66 years - 70 years1200000",55308,67197,136042,82510,32460,4677,16934]
[1200000,"More than 70 years","More than 70 years1200000",129253,155857,290849,155538,72116,13370,48927]
[1300000,"91 days - 25 years","91 days - 25 years1300000",1574,1973,2830,1153,1029,521,884]
[1300000,"26 years - 30 years","26 years - 30 years1300000",2083,2434,3366,1467,1260,572,1025]
[1300000,"31 years - 35 years","31 years - 35 years1300000",3374,3740,5204,2904,1739,685,1333]
[1300000,"36 years - 40 years","36 years - 40 years1300000",4829,5152,7184,5834,2501,839,1782]
[1300000,"41 years - 45 years","41 years - 45 years1300000",8766,9134,12763,11793,3877,1060,2485]
[1300000,"46 years - 50 years","46 years - 50 years1300000",11741,13302,26177,19874,6313,1354,3518]
[1300000,"51 years - 55 years","51 years - 55 years1300000",18383,20847,40541,29403,10163,1739,5061]
[1300000,"56 years - 60 years","56 years - 60 years1300000",32645,37474,69368,53781,16224,2602,7448]
[1300000,"61 years - 65 years","61 years - 65 years1300000",45849,53933,110868,72389,26636,3856,12532]
[1300000,"66 years - 70 years","66 years - 70 years1300000",59854,72734,147316,89341,35117,5032,18330]
[1300000,"More than 70 years","More than 70 years1300000",139959,168780,315021,168451,78075,14449,52989]
[1400000,"91 days - 25 years","91 days - 25 years1400000",1682,2111,3034,1229,1095,548,938]
[1400000,"26 years - 30 years","26 years - 30 years1400000",2229,2607,3612,1566,1343,603,1090]
[1400000,"31 years - 35 years","31 years - 35 years1400000",3620,4014,5591,3114,1859,724,1422]
[1400000,"36 years - 40 years","36 years - 40 years1400000",5187,5534,7723,6269,2680,890,1905]
[1400000,"41 years - 45 years","41 years - 45 years1400000",9427,9823,13731,12687,4161,1128,2662]
[1400000,"46 years - 50 years","46 years - 50 years1400000",12621,14303,28168,21376,6785,1445,3775]
[1400000,"51 years - 55 years","51 years - 55 years1400000",19740,22394,43603,31637,10931,1859,5437]
[1400000,"56 years - 60 years","56 years - 60 years1400000",35099,40299,74647,57878,17429,2771,8008]
[1400000,"61 years - 65 years","61 years - 65 years1400000",49318,58024,119338,77917,28641,4120,13482]
[1400000,"66 years - 70 years","66 years - 70 years1400000",64400,78270,158590,96172,37774,5387,19726]
[1400000,"More than 70 years","More than 70 years1400000",150665,181703,339193,181364,84034,15527,57050]
[1500000,"91 days - 25 years","91 days - 25 years1500000",1789,2249,3238,1304,1160,574,994]
[1500000,"26 years - 30 years","26 years - 30 years1500000",2375,2781,3854,1665,1427,633,1155]
[1500000,"31 years - 35 years","31 years - 35 years1500000",3865,4287,5976,3324,1978,762,1511]
[1500000,"36 years - 40 years","36 years - 40 years1500000",5549,5914,8257,6704,2858,941,2028]
[1500000,"41 years - 45 years","41 years - 45 years1500000",10087,10511,14699,13579,4445,1196,2838]
[1500000,"46 years - 50 years","46 years - 50 years1500000",13501,15304,30148,22877,7256,1535,4030]
[1500000,"51 years - 55 years","51 years - 55 years1500000",21098,23935,46653,33872,11697,1979,5812]
[1500000,"56 years - 60 years","56 years - 60 years1500000",37552,43124,79925,61976,18631,2939,8567]
[1500000,"61 years - 65 years","61 years - 65 years1500000",52789,62115,127792,83442,30643,4384,14428]
[1500000,"66 years - 70 years","66 years - 70 years1500000",68947,83807,169863,103004,40431,5742,21122]
[1500000,"More than 70 years","More than 70 years1500000",161371,194626,363364,194277,89992,16608,61112]
[1600000,"91 days - 25 years","91 days - 25 years1600000",1897,2387,3443,1379,1226,601,1047]
[1600000,"26 years - 30 years","26 years - 30 years1600000",2522,2955,4102,1764,1510,664,1220]
[1600000,"31 years - 35 years","31 years - 35 years1600000",4112,4562,6364,3534,2099,802,1600]
[1600000,"36 years - 40 years","36 years - 40 years1600000",5903,6300,8801,7140,3037,991,2152]
[1600000,"41 years - 45 years","41 years - 45 years1600000",10749,11201,15667,14474,4731,1264,3017]
[1600000,"46 years - 50 years","46 years - 50 years1600000",14383,16305,32150,24380,7730,1626,4290]
[1600000,"51 years - 55 years","51 years - 55 years1600000",22455,25488,49727,36107,12467,2099,6188]
[1600000,"56 years - 60 years","56 years - 60 years1600000",40007,45951,85205,66073,19838,3107,9126]
[1600000,"61 years - 65 years","61 years - 65 years1600000",56257,66207,136280,88973,32652,4650,15383]
[1600000,"66 years - 70 years","66 years - 70 years1600000",73493,89344,181137,109835,43088,6097,22518]
[1600000,"More than 70 years","More than 70 years1600000",172077,207549,387537,207190,95953,17684,65174]
[1700000,"91 days - 25 years","91 days - 25 years1700000",2004,2525,3647,1454,1292,627,1101]
[1700000,"26 years - 30 years","26 years - 30 years1700000",2669,3128,4348,1864,1593,694,1286]
[1700000,"31 years - 35 years","31 years - 35 years1700000",4358,4836,6751,3744,2219,841,1689]
[1700000,"36 years - 40 years","36 years - 40 years1700000",6260,6683,9340,7575,3216,1042,2275]
[1700000,"41 years - 45 years","41 years - 45 years1700000",11409,11890,16635,15367,5015,1332,3195]
[1700000,"46 years - 50 years","46 years - 50 years1700000",15264,17306,34142,25882,8202,1716,4547]
[1700000,"51 years - 55 years",{"$f":"B195&A195","v":"51 years - 55 years1700000"},23813,27035,52789,38341,13235,2219,6563]
[1700000,"56 years - 60 years","56 years - 60 years1700000",42462,48776,90483,70170,21043,3276,9685]
[1700000,"61 years - 65 years","61 years - 65 years1700000",59727,70298,144750,94501,34657,4914,16333]
[1700000,"66 years - 70 years","66 years - 70 years1700000",78039,94881,192411,116666,45745,6452,23915]
[1700000,"More than 70 years","More than 70 years1700000",182783,220472,411709,220103,101912,18762,69236]
[1800000,"91 days - 25 years","91 days - 25 years1800000",2112,2664,3851,1529,1357,654,1156]
[1800000,"26 years - 30 years","26 years - 30 years1800000",2816,3302,4593,1963,1677,724,1351]
[1800000,"31 years - 35 years","31 years - 35 years1800000",4604,5110,7137,3953,2340,881,1778]
[1800000,"36 years - 40 years","36 years - 40 years1800000",6618,7065,9879,8010,3395,1093,2399]
[1800000,"41 years - 45 years","41 years - 45 years1800000",12070,12579,17603,16261,5300,1400,3372]
[1800000,"46 years - 50 years","46 years - 50 years1800000",16145,18307,36133,27384,8674,1807,4804]
[1800000,"51 years - 55 years","51 years - 55 years1800000",25170,28582,55851,40576,14004,2339,6939]
[1800000,"56 years - 60 years","56 years - 60 years1800000",44916,51602,95762,74268,22248,3444,10245]
[1800000,"61 years - 65 years","61 years - 65 years1800000",63197,74390,153221,100029,36662,5179,17283]
[1800000,"66 years - 70 years","66 years - 70 years1800000",82585,100418,203684,123497,48402,6807,25311]
[1800000,"More than 70 years","More than 70 years1800000",193489,233395,435881,233016,107871,19840,73297]
[1900000,"91 days - 25 years","91 days - 25 years1900000",2220,2802,4055,1604,1423,680,1210]
[1900000,"26 years - 30 years","26 years - 30 years1900000",2962,3476,4838,2062,1760,755,1416]
[1900000,"31 years - 35 years","31 years - 35 years1900000",4850,5384,7524,4163,2460,920,1867]
[1900000,"36 years - 40 years","36 years - 40 years1900000",6976,7448,10418,8445,3574,1144,2522]
[1900000,"41 years - 45 years","41 years - 45 years1900000",12731,13268,18572,17154,5584,1468,3550]
[1900000,"46 years - 50 years","46 years - 50 years1900000",17025,19308,38124,28885,9146,1897,5061]
[1900000,"51 years - 55 years","51 years - 55 years1900000",26528,30129,58913,42810,14772,2459,7315]
[1900000,"56 years - 60 years","56 years - 60 years1900000",47370,54428,101041,78365,23452,3613,10804]
[1900000,"61 years - 65 years","61 years - 65 years1900000",66666,78481,161691,105556,38667,5444,18233]
[1900000,"66 years - 70 years","66 years - 70 years1900000",87132,105955,214958,130328,51059,7162,26707]
[1900000,"More than 70 years","More than 70 years1900000",204195,246318,460053,245929,113830,20919,77359]
[2000000,"91 days - 25 years","91 days - 25 years2000000",2327,2940,4259,1679,1488,707,1265]
[2000000,"26 years - 30 years","26 years - 30 years2000000",3109,3649,5084,2161,1843,785,1481]
[2000000,"31 years - 35 years","31 years - 35 years2000000",5096,5658,7911,4373,2580,959,1956]
[2000000,"36 years - 40 years","36 years - 40 years2000000",7334,7831,10957,8881,3753,1195,2646]
[2000000,"41 years - 45 years","41 years - 45 years2000000",13392,13957,19540,18048,5869,1536,3727]
[2000000,"46 years - 50 years","46 years - 50 years2000000",17906,20309,40116,30387,9618,1988,5318]
[2000000,"51 years - 55 years","51 years - 55 years2000000",27885,31677,61974,45045,15540,2579,7690]
[2000000,"56 years - 60 years","56 years - 60 years2000000",49824,57253,106320,82462,24657,3781,11363]
[2000000,"61 years - 65 years","61 years - 65 years2000000",70136,82572,170162,111084,40673,5708,19184]
[2000000,"66 years - 70 years","66 years - 70 years2000000",91678,111492,226231,137160,53716,7517,28103]
[2000000,"More than 70 years","More than 70 years2000000",214901,259241,484225,258843,119789,21997,81421]
[2100000,"91 days - 25 years","91 days - 25 years2100000",2435,3078,4463,1755,1554,733,1319]
[2100000,"26 years - 30 years","26 years - 30 years2100000",3255,3823,5329,2260,1927,816,1547]
[2100000,"31 years - 35 years","31 years - 35 years2100000",5342,5932,8298,4583,2700,998,2045]
[2100000,"36 years - 40 years","36 years - 40 years2100000",7692,8214,11496,9316,3931,1246,2769]
[2100000,"41 years - 45 years","41 years - 45 years2100000",14052,14646,20508,18941,6154,1603,3905]
[2100000,"46 years - 50 years","46 years - 50 years2100000",18787,21310,42107,31889,10090,2079,5575]
[2100000,"51 years - 55 years","51 years - 55 years2100000",29243,33224,65036,47280,16308,2699,8066]
[2100000,"56 years - 60 years","56 years - 60 years2100000",52278,60079,111599,86560,25862,3950,11922]
[2100000,"61 years - 65 years","61 years - 65 years2100000",73605,86663,178632,116612,42678,5973,20134]
[2100000,"66 years - 70 years","66 years - 70 years2100000",96224,117029,237505,143991,56373,7872,29499]
[2100000,"More than 70 years","More than 70 years2100000",225607,272164,508397,271756,125748,23075,85483]
[2200000,"91 days - 25 years","91 days - 25 years2200000",2542,3216,4667,1830,1620,760,1374]
[2200000,"26 years - 30 years","26 years - 30 years2200000",3402,3997,5574,2360,2010,846,1612]
[2200000,"31 years - 35 years","31 years - 35 years2200000",5588,6207,8684,4793,2820,1037,2134]
[2200000,"36 years - 40 years","36 years - 40 years2200000",8050,8596,12035,9751,4110,1297,2893]
[2200000,"41 years - 45 years","41 years - 45 years2200000",14713,15335,21476,19835,6438,1671,4082]
[2200000,"46 years - 50 years","46 years - 50 years2200000",19668,22311,44098,33391,10562,2169,5832]
[2200000,"51 years - 55 years","51 years - 55 years2200000",30600,34771,68098,49514,17076,2819,8442]
[2200000,"56 years - 60 years","56 years - 60 years2200000",54733,62904,116878,90657,27067,4118,12482]
[2200000,"61 years - 65 years","61 years - 65 years2200000",77075,90755,187103,122140,44683,6238,21084]
[2200000,"66 years - 70 years","66 years - 70 years2200000",100770,122566,248779,150822,59030,8227,30895]
[2200000,"More than 70 years","More than 70 years2200000",236313,285087,532569,284669,131707,24154,89544]
[2300000,"91 days - 25 years","91 days - 25 years2300000",2650,3354,4872,1905,1685,786,1428]
[2300000,"26 years - 30 years","26 years - 30 years2300000",3549,4170,5820,2459,2093,877,1677]
[2300000,"31 years - 35 years","31 years - 35 years2300000",5834,6481,9071,5002,2940,1076,2223]
[2300000,"36 years - 40 years","36 years - 40 years2300000",8408,8979,12574,10186,4289,1348,3016]
[2300000,"41 years - 45 years",{"$f":"B259&A259","v":"41 years - 45 years2300000"},15374,16024,22444,20729,6723,1739,4260]
[2300000,"46 years - 50 years","46 years - 50 years2300000",20549,23312,46089,34893,11034,2260,6089]
[2300000,"51 years - 55 years","51 years - 55 years2300000",31958,36318,71160,51749,17844,2940,8817]
[2300000,"56 years - 60 years","56 years - 60 years2300000",57187,65730,122156,94754,28272,4287,13041]
[2300000,"61 years - 65 years","61 years - 65 years2300000",80544,94846,195573,127668,46688,6502,22034]
[2300000,"66 years - 70 years","66 years - 70 years2300000",105317,128103,260052,157653,61687,8582,32291]
[2300000,"More than 70 years","More than 70 years2300000",247019,298009,556741,297582,137666,25232,93606]
[2400000,"91 days - 25 years","91 days - 25 years2400000",2757,3493,5076,1980,1751,813,1482]
[2400000,"26 years - 30 years","26 years - 30 years2400000",3695,4344,6065,2558,2177,907,1742]
[2400000,"31 years - 35 years","31 years - 35 years2400000",6080,6755,9458,5212,3061,1115,2312]
[2400000,"36 years - 40 years","36 years - 40 years2400000",8766,9362,13113,10621,4468,1399,3140]
[2400000,"41 years - 45 years","41 years - 45 years2400000",16035,16713,23412,21622,7007,1807,4437]
[2400000,"46 years - 50 years","46 years - 50 years2400000",21430,24313,48081,36395,11506,2350,6346]
[2400000,"51 years - 55 years","51 years - 55 years2400000",33315,37865,74222,53984,18612,3060,9193]
[2400000,"56 years - 60 years","56 years - 60 years2400000",59641,68556,127435,98852,29476,4455,13600]
[2400000,"61 years - 65 years","61 years - 65 years2400000",84014,98937,204044,133196,48693,6767,22985]
[2400000,"66 years - 70 years","66 years - 70 years2400000",109863,133639,271326,164485,64344,8937,33688]
[2400000,"More than 70 years","More than 70 years2400000",257725,310932,580913,310495,143625,26310,97668]
[2500000,"91 days - 25 years","91 days - 25 years2500000",2865,3631,5280,2055,1816,839,1537]
[2500000,"26 years - 30 years","26 years - 30 years2500000",3842,4518,6311,2657,2260,937,1808]
[2500000,"31 years - 35 years","31 years - 35 years2500000",6327,7029,9845,5422,3181,1154,2401]
[2500000,"36 years - 40 years","36 years - 40 years2500000",9123,9744,13652,11057,4647,1450,3263]
[2500000,"41 years - 45 years","41 years - 45 years2500000",16695,17402,24381,22516,7292,1875,4615]
[2500000,"46 years - 50 years","46 years - 50 years2500000",22310,25314,50072,37897,11978,2441,6603]
[2500000,"51 years - 55 years","51 years - 55 years2500000",34673,39412,77284,56218,19380,3180,9569]
[2500000,"56 years - 60 years","56 years - 60 years2500000",62095,71381,132714,102949,30681,4623,14159]
[2500000,"61 years - 65 years","61 years - 65 years2500000",87483,103028,212514,138724,50698,7032,23935]
[2500000,"66 years - 70 years","66 years - 70 years2500000",114409,139176,282599,171316,67001,9292,35084]
[2500000,"More than 70 years","More than 70 years2500000",268431,323855,605085,323408,149584,27389,101730]
[2600000,"91 days - 25 years","91 days - 25 years2600000",2972,3769,5484,2130,1882,866,1591]
[2600000,"26 years - 30 years","26 years - 30 years2600000",3989,4691,6556,2757,2343,968,1873]
[2600000,"31 years - 35 years","31 years - 35 years2600000",6573,7303,10231,5632,3301,1193,2490]
[2600000,"36 years - 40 years","36 years - 40 years2600000",9481,10127,14191,11492,4825,1501,3387]
[2600000,"41 years - 45 years","41 years - 45 years2600000",17356,18091,25349,23409,7577,1943,4793]
[2600000,"46 years - 50 years","46 years - 50 years2600000",23191,26315,52063,39399,12450,2531,6860]
[2600000,"51 years - 55 years","51 years - 55 years2600000",36030,40959,80346,58453,20148,3300,9944]
[2600000,"56 years - 60 years","56 years - 60 years2600000",64549,74207,137993,107046,31886,4792,14718]
[2600000,"61 years - 65 years","61 years - 65 years2600000",90953,107120,220985,144252,52704,7296,24885]
[2600000,"66 years - 70 years","66 years - 70 years2600000",118955,144713,293873,178147,69658,9646,36480]
[2600000,"More than 70 years","More than 70 years2600000",279137,336778,629256,336321,155544,28467,105791]
[2700000,"91 days - 25 years","91 days - 25 years2700000",3080,3907,5688,2206,1948,892,1646]
[2700000,"26 years - 30 years","26 years - 30 years2700000",4135,4865,6801,2856,2427,998,1938]
[2700000,"31 years - 35 years","31 years - 35 years2700000",6819,7577,10618,5842,3421,1233,2579]
[2700000,"36 years - 40 years","36 years - 40 years2700000",9839,10510,14730,11927,5004,1552,3510]
[2700000,"41 years - 45 years","41 years - 45 years2700000",18017,18780,26317,24303,7861,2011,4970]
[2700000,"46 years - 50 years","46 years - 50 years2700000",24072,27316,54055,40901,12922,2622,7117]
[2700000,"51 years - 55 years","51 years - 55 years2700000",37388,42506,83407,60688,20916,3420,10320]
[2700000,"56 years - 60 years","56 years - 60 years2700000",67004,77033,143272,111143,33091,4960,15278]
[2700000,"61 years - 65 years","61 years - 65 years2700000",94422,111211,229455,149780,54709,7561,25835]
[2700000,"66 years - 70 years","66 years - 70 years2700000",123502,150250,305147,184978,72315,10001,37876]
[2700000,"More than 70 years","More than 70 years2700000",289843,349701,653428,349234,161503,29545,109853]
[2800000,"91 days - 25 years","91 days - 25 years2800000",3187,4045,5892,2281,2013,919,1700]
[2800000,"26 years - 30 years","26 years - 30 years2800000",4282,5039,7047,2955,2510,1029,2003]
[2800000,"31 years - 35 years","31 years - 35 years2800000",7065,7851,11005,6052,3541,1272,2668]
[2800000,"36 years - 40 years","36 years - 40 years2800000",10197,10893,15269,12362,5183,1603,3633]
[2800000,"41 years - 45 years","41 years - 45 years2800000",18678,19469,27285,25196,8146,2079,5148]
[2800000,"46 years - 50 years","46 years - 50 years2800000",24953,28317,56046,42402,13394,2712,7374]
[2800000,"51 years - 55 years","51 years - 55 years2800000",38745,44053,86469,62922,21684,3540,10695]
[2800000,"56 years - 60 years","56 years - 60 years2800000",69458,79858,148551,115241,34296,5129,15837]
[2800000,"61 years - 65 years","61 years - 65 years2800000",97892,115302,237926,155308,56714,7825,26785]
[2800000,"66 years - 70 years","66 years - 70 years2800000",128048,155787,316420,191809,74972,10356,39272]
[2800000,"More than 70 years","More than 70 years2800000",300548,362624,677600,362147,167462,30624,113915]
[2900000,"91 days - 25 years","91 days - 25 years2900000",3295,4184,6096,2356,2079,945,1754]
[2900000,"26 years - 30 years","26 years - 30 years2900000",4428,5212,7292,3054,2593,1059,2069]
[2900000,"31 years - 35 years",{"$f":"B323&A323","v":"31 years - 35 years2900000"},7311,8125,11391,6261,3661,1311,2757]
[2900000,"36 years - 40 years","36 years - 40 years2900000",10555,11275,15808,12798,5362,1654,3757]
[2900000,"41 years - 45 years","41 years - 45 years2900000",19339,20158,28253,26090,8430,2147,5325]
[2900000,"46 years - 50 years","46 years - 50 years2900000",25834,29318,58037,43904,13866,2803,7631]
[2900000,"51 years - 55 years","51 years - 55 years2900000",40103,45600,89531,65157,22453,3660,11071]
[2900000,"56 years - 60 years","56 years - 60 years2900000",71912,82684,153829,119338,35500,5297,16396]
[2900000,"61 years - 65 years","61 years - 65 years2900000",101361,119393,246396,160836,58719,8090,27736]
[2900000,"66 years - 70 years","66 years - 70 years2900000",132594,161324,327694,198641,77629,10711,40668]
[2900000,"More than 70 years","More than 70 years2900000",311254,375547,701772,375060,173421,31702,117977]
[3000000,"91 days - 25 years","91 days - 25 years3000000",3402,4322,6301,2431,2144,972,1809]
[3000000,"26 years - 30 years","26 years - 30 years3000000",4575,5386,7537,3154,2677,1090,2134]
[3000000,"31 years - 35 years","31 years - 35 years3000000",7557,8399,11778,6471,3782,1350,2846]
[3000000,"36 years - 40 years","36 years - 40 years3000000",10913,11658,16347,13233,5540,1705,3880]
[3000000,"41 years - 45 years","41 years - 45 years3000000",19999,20847,29222,26983,8715,2215,5503]
[3000000,"46 years - 50 years","46 years - 50 years3000000",26715,30319,60028,45406,14338,2893,7888]
[3000000,"51 years - 55 years","51 years - 55 years3000000",41460,47147,92593,67392,23221,3780,11447]
[3000000,"56 years - 60 years","56 years - 60 years3000000",74366,85510,159108,123435,36705,5466,16955]
[3000000,"61 years - 65 years","61 years - 65 years3000000",104831,123485,254867,166364,60724,8355,28686]
[3000000,"66 years - 70 years","66 years - 70 years3000000",137140,166861,338968,205472,80286,11066,42064]
[3000000,"More than 70 years","More than 70 years3000000",321960,388470,725944,387973,179380,32780,122038]
[3100000,"91 days - 25 years","91 days - 25 years3100000",3510,4460,6505,2506,2210,998,1863]
[3100000,"26 years - 30 years","26 years - 30 years3100000",4722,5560,7783,3253,2760,1120,2199]
[3100000,"31 years - 35 years","31 years - 35 years3100000",7803,8673,12165,6681,3902,1389,2935]
[3100000,"36 years - 40 years","36 years - 40 years3100000",11271,12041,16886,13668,5719,1755,4004]
[3100000,"41 years - 45 years","41 years - 45 years3100000",20660,21536,30190,27877,9000,2283,5680]
[3100000,"46 years - 50 years","46 years - 50 years3100000",27595,31320,62020,46908,14810,2984,8145]
[3100000,"51 years - 55 years","51 years - 55 years3100000",42818,48694,95655,69626,23989,3900,11822]
[3100000,"56 years - 60 years","56 years - 60 years3100000",76820,88335,164387,127533,37910,5634,17515]
[3100000,"61 years - 65 years","61 years - 65 years3100000",108300,127576,263337,171892,62730,8619,29636]
[3100000,"66 years - 70 years","66 years - 70 years3100000",141687,172398,350241,212303,82943,11421,43460]
[3100000,"More than 70 years","More than 70 years3100000",332666,401393,750116,400886,185339,33859,126100]
[3200000,"91 days - 25 years","91 days - 25 years3200000",3617,4598,6709,2581,2276,1025,1918]
[3200000,"26 years - 30 years","26 years - 30 years3200000",4868,5733,8028,3352,2843,1151,2264]
[3200000,"31 years - 35 years","31 years - 35 years3200000",8049,8947,12552,6891,4022,1428,3024]
[3200000,"36 years - 40 years","36 years - 40 years3200000",11629,12423,17425,14103,5898,1806,4127]
[3200000,"41 years - 45 years","41 years - 45 years3200000",21321,22225,31158,28771,9284,2351,5858]
[3200000,"46 years - 50 years","46 years - 50 years3200000",28476,32321,64011,48410,15282,3075,8402]
[3200000,"51 years - 55 years","51 years - 55 years3200000",44175,50241,98717,71861,24757,4020,12198]
[3200000,"56 years - 60 years","56 years - 60 years3200000",79275,91161,169666,131630,39115,5802,18074]
[3200000,"61 years - 65 years","61 years - 65 years3200000",111770,131667,271808,177419,64735,8884,30586]
[3200000,"66 years - 70 years","66 years - 70 years3200000",146233,177935,361515,219134,85600,11776,44857]
[3200000,"More than 70 years","More than 70 years3200000",343372,414316,774288,413799,191298,34937,130162]
[3300000,"91 days - 25 years","91 days - 25 years3300000",3725,4736,6913,2656,2341,1051,1972]
[3300000,"26 years - 30 years","26 years - 30 years3300000",5015,5907,8274,3451,2927,1181,2330]
[3300000,"31 years - 35 years","31 years - 35 years3300000",8295,9222,12938,7101,4142,1467,3113]
[3300000,"36 years - 40 years","36 years - 40 years3300000",11987,12806,17964,14538,6077,1857,4251]
[3300000,"41 years - 45 years","41 years - 45 years3300000",21982,22914,32126,29664,9569,2419,6035]
[3300000,"46 years - 50 years","46 years - 50 years3300000",29357,33322,66002,49912,15754,3165,8659]
[3300000,"51 years - 55 years","51 years - 55 years3300000",45533,51788,101779,74095,25525,4140,12574]
[3300000,"56 years - 60 years","56 years - 60 years3300000",81729,93987,174945,135727,40319,5971,18633]
[3300000,"61 years - 65 years","61 years - 65 years3300000",115239,135759,280278,182947,66740,9149,31536]
[3300000,"66 years - 70 years","66 years - 70 years3300000",150779,183472,372788,225965,88257,12131,46253]
[3300000,"More than 70 years","More than 70 years3300000",354078,427238,798460,426712,197257,36015,134224]
[3400000,"91 days - 25 years","91 days - 25 years3400000",3833,4874,7117,2732,2407,1078,2026]
[3400000,"26 years - 30 years","26 years - 30 years3400000",5162,6080,8519,3551,3010,1211,2395]
[3400000,"31 years - 35 years","31 years - 35 years3400000",8541,9496,13325,7311,4262,1506,3202]
[3400000,"36 years - 40 years","36 years - 40 years3400000",12344,13189,18503,14974,6256,1908,4374]
[3400000,"41 years - 45 years","41 years - 45 years3400000",22642,23603,33094,30558,9853,2487,6213]
[3400000,"46 years - 50 years","46 years - 50 years3400000",30238,34323,67994,51414,16226,3256,8916]
[3400000,"51 years - 55 years","51 years - 55 years3400000",46890,53335,104840,76330,26293,4261,12949]
[3400000,"56 years - 60 years","56 years - 60 years3400000",84183,96812,180223,139825,41524,6139,19192]
[3400000,"61 years - 65 years","61 years - 65 years3400000",118709,139850,288749,188475,68745,9413,32487]
[3400000,"66 years - 70 years","66 years - 70 years3400000",155325,189009,384062,232797,90914,12486,47649]
[3400000,"More than 70 years","More than 70 years3400000",364784,440161,822632,439625,203216,37094,138285]
[3500000,"91 days - 25 years",{"$f":"B387&A387","v":"91 days - 25 years3500000"},3940,5013,7321,2807,2472,1104,2081]
[3500000,"26 years - 30 years","26 years - 30 years3500000",5308,6254,8764,3650,3093,1242,2460]
[3500000,"31 years - 35 years","31 years - 35 years3500000",8787,9770,13712,7520,4382,1546,3291]
[3500000,"36 years - 40 years","36 years - 40 years3500000",12702,13572,19042,15409,6434,1959,4498]
[3500000,"41 years - 45 years","41 years - 45 years3500000",23303,24292,34062,31451,10138,2555,6390]
[3500000,"46 years - 50 years","46 years - 50 years3500000",31119,35324,69985,52916,16698,3346,9173]
[3500000,"51 years - 55 years","51 years - 55 years3500000",48248,54882,107902,78565,27061,4381,13325]
[3500000,"56 years - 60 years","56 years - 60 years3500000",86637,99638,185502,143922,42729,6308,19752]
[3500000,"61 years - 65 years","61 years - 65 years3500000",122178,143941,297219,194003,70750,9678,33437]
[3500000,"66 years - 70 years","66 years - 70 years3500000",159872,194545,395336,239628,93571,12841,49045]
[3500000,"More than 70 years","More than 70 years3500000",375490,453084,846804,452538,209175,38172,142347]
[3600000,"91 days - 25 years","91 days - 25 years3600000",4048,5151,7525,2882,2538,1131,2135]
[3600000,"26 years - 30 years","26 years - 30 years3600000",5455,6428,9010,3749,3177,1272,2525]
[3600000,"31 years - 35 years","31 years - 35 years3600000",9033,10044,14099,7730,4503,1585,3380]
[3600000,"36 years - 40 years","36 years - 40 years3600000",13060,13954,19581,15844,6613,2010,4621]
[3600000,"41 years - 45 years","41 years - 45 years3600000",23964,24981,35031,32345,10423,2623,6568]
[3600000,"46 years - 50 years","46 years - 50 years3600000",32000,36325,71976,54417,17170,3437,9430]
[3600000,"51 years - 55 years","51 years - 55 years3600000",49605,56429,110964,80799,27829,4501,13701]
[3600000,"56 years - 60 years","56 years - 60 years3600000",89091,102463,190781,148019,43934,6476,20311]
[3600000,"61 years - 65 years","61 years - 65 years3600000",125648,148032,305690,199531,72756,9943,34387]
[3600000,"66 years - 70 years","66 years - 70 years3600000",164418,200082,406609,246459,96228,13196,50441]
[3600000,"More than 70 years","More than 70 years3600000",386196,466007,870976,465451,215135,39250,146409]
[3700000,"91 days - 25 years","91 days - 25 years3700000",4155,5289,7729,2957,2603,1157,2190]
[3700000,"26 years - 30 years","26 years - 30 years3700000",5601,6601,9255,3848,3260,1303,2591]
[3700000,"31 years - 35 years","31 years - 35 years3700000",9279,10318,14485,7940,4623,1624,3469]
[3700000,"36 years - 40 years","36 years - 40 years3700000",13418,14337,20120,16279,6792,2061,4745]
[3700000,"41 years - 45 years","41 years - 45 years3700000",24625,25670,35999,33238,10707,2691,6745]
[3700000,"46 years - 50 years","46 years - 50 years3700000",32880,37326,73967,55919,17642,3527,9687]
[3700000,"51 years - 55 years","51 years - 55 years3700000",50963,57976,114026,83034,28597,4621,14076]
[3700000,"56 years - 60 years","56 years - 60 years3700000",91546,105289,196060,152117,45139,6645,20870]
[3700000,"61 years - 65 years","61 years - 65 years3700000",129117,152124,314160,205059,74761,10207,35337]
[3700000,"66 years - 70 years","66 years - 70 years3700000",168964,205619,417883,253290,98885,13551,51837]
[3700000,"More than 70 years","More than 70 years3700000",396902,478930,895148,478364,221094,40329,150471]
[3800000,"91 days - 25 years","91 days - 25 years3800000",4263,5427,7934,3032,2669,1184,2244]
[3800000,"26 years - 30 years","26 years - 30 years3800000",5748,6775,9500,3948,3343,1333,2656]
[3800000,"31 years - 35 years","31 years - 35 years3800000",9525,10592,14872,8150,4743,1663,3558]
[3800000,"36 years - 40 years","36 years - 40 years3800000",13776,14720,20659,16714,6971,2112,4868]
[3800000,"41 years - 45 years","41 years - 45 years3800000",25285,26359,36967,34132,10992,2758,6923]
[3800000,"46 years - 50 years","46 years - 50 years3800000",33761,38327,75959,57421,18114,3618,9944]
[3800000,"51 years - 55 years","51 years - 55 years3800000",52320,59523,117088,85269,29365,4741,14452]
[3800000,"56 years - 60 years","56 years - 60 years3800000",94000,108115,201339,156214,46343,6813,21429]
[3800000,"61 years - 65 years","61 years - 65 years3800000",132587,156215,322631,210587,76766,10472,36288]
[3800000,"66 years - 70 years","66 years - 70 years3800000",173510,211156,429156,260121,101542,13906,53233]
[3800000,"More than 70 years","More than 70 years3800000",407608,491853,919320,491278,227053,41407,154532]
[3900000,"91 days - 25 years","91 days - 25 years3900000",4370,5565,8138,3107,2735,1210,2299]
[3900000,"26 years - 30 years","26 years - 30 years3900000",5895,6949,9746,4047,3427,1364,2721]
[3900000,"31 years - 35 years","31 years - 35 years3900000",9771,10866,15259,8360,4863,1702,3647]
[3900000,"36 years - 40 years","36 years - 40 years3900000",14134,15102,21198,17150,7150,2163,4991]
[3900000,"41 years - 45 years","41 years - 45 years3900000",25946,27048,37935,35025,11277,2826,7100]
[3900000,"46 years - 50 years","46 years - 50 years3900000",34642,39328,77950,58923,18586,3708,10201]
[3900000,"51 years - 55 years","51 years - 55 years3900000",53678,61070,120150,87503,30133,4861,14827]
[3900000,"56 years - 60 years","56 years - 60 years3900000",96454,110940,206618,160311,47548,6981,21989]
[3900000,"61 years - 65 years","61 years - 65 years3900000",136056,160306,331101,216115,78771,10737,37238]
[3900000,"66 years - 70 years","66 years - 70 years3900000",178057,216693,440430,266953,104199,14261,54630]
[3900000,"More than 70 years","More than 70 years3900000",418314,504776,943492,504191,233012,42485,158594]
[4000000,"91 days - 25 years","91 days - 25 years4000000",4478,5704,8342,3182,2800,1237,2353]
[4000000,"26 years - 30 years","26 years - 30 years4000000",6041,7122,9991,4146,3510,1394,2786]
[4000000,"31 years - 35 years","31 years - 35 years4000000",10017,11140,15646,8570,4983,1741,3736]
[4000000,"36 years - 40 years","36 years - 40 years4000000",14492,15485,21737,17585,7328,2214,5115]
[4000000,"41 years - 45 years","41 years - 45 years4000000",26607,27737,38903,35919,11561,2894,7278]
[4000000,"46 years - 50 years","46 years - 50 years4000000",35523,40329,79941,60425,19058,3799,10458]
[4000000,"51 years - 55 years","51 years - 55 years4000000",55035,62617,123211,89738,30902,4981,15203]
[4000000,"56 years - 60 years","56 years - 60 years4000000",98908,113766,211896,164408,48753,7150,22548]
[4000000,"61 years - 65 years","61 years - 65 years4000000",139526,164397,339572,221643,80776,11001,38188]
[4000000,"66 years - 70 years",{"$f":"B451&A451","v":"66 years - 70 years4000000"},182603,222230,451704,273784,106855,14615,56026]
[4000000,"More than 70 years","More than 70 years4000000",429020,517699,967664,517104,238971,43564,162656]
[4100000,"91 days - 25 years","91 days - 25 years4100000",4585,5842,8546,3258,2866,1263,2407]
[4100000,"26 years - 30 years","26 years - 30 years4100000",6188,7296,10236,4245,3593,1424,2852]
[4100000,"31 years - 35 years","31 years - 35 years4100000",10263,11414,16032,8779,5103,1780,3825]
[4100000,"36 years - 40 years","36 years - 40 years4100000",14850,15868,22276,18020,7507,2265,5238]
[4100000,"41 years - 45 years","41 years - 45 years4100000",27380,28539,39984,36813,11846,2962,7456]
[4100000,"46 years - 50 years","46 years - 50 years4100000",36404,41330,81933,61927,19530,3890,10715]
[4100000,"51 years - 55 years","51 years - 55 years4100000",56393,64165,126273,91973,31670,5101,15579]
[4100000,"56 years - 60 years","56 years - 60 years4100000",101363,116592,217175,168506,49958,7318,23140]
[4100000,"61 years - 65 years","61 years - 65 years4100000",142996,168489,348042,227171,82781,11266,39171]
[4100000,"66 years - 70 years","66 years - 70 years4100000",187149,227767,462977,280615,109512,14970,57455]
[4100000,"More than 70 years","More than 70 years4100000",439726,530622,991836,530017,244930,44642,166753]
[4200000,"91 days - 25 years","91 days - 25 years4200000",4693,5980,8750,3333,2931,1290,2462]
[4200000,"26 years - 30 years","26 years - 30 years4200000",6335,7470,10482,4344,3677,1455,2917]
[4200000,"31 years - 35 years","31 years - 35 years4200000",10509,11688,16419,8989,5224,1819,3914]
[4200000,"36 years - 40 years","36 years - 40 years4200000",15207,16251,22815,18455,7686,2316,5362]
[4200000,"41 years - 45 years","41 years - 45 years4200000",28041,29228,40953,37706,12130,3030,7633]
[4200000,"46 years - 50 years","46 years - 50 years4200000",37284,42331,83924,63429,20002,3980,10972]
[4200000,"51 years - 55 years","51 years - 55 years4200000",57750,65712,129335,94207,32438,5221,15954]
[4200000,"56 years - 60 years","56 years - 60 years4200000",103817,119417,222454,172603,51163,7487,23699]
[4200000,"61 years - 65 years","61 years - 65 years4200000",146466,172580,356513,232699,84786,11531,40121]
[4200000,"66 years - 70 years","66 years - 70 years4200000",191695,233304,474251,287446,112169,15325,58851]
[4200000,"More than 70 years","More than 70 years4200000",450432,543545,1016008,542930,250889,45720,170815]
[4300000,"91 days - 25 years","91 days - 25 years4300000",4800,6118,8954,3408,2997,1316,2516]
[4300000,"26 years - 30 years","26 years - 30 years4300000",6481,7643,10727,4444,3760,1485,2982]
[4300000,"31 years - 35 years","31 years - 35 years4300000",10755,11963,16806,9199,5344,1858,4003]
[4300000,"36 years - 40 years","36 years - 40 years4300000",15565,16633,23354,18890,7865,2367,5485]
[4300000,"41 years - 45 years","41 years - 45 years4300000",28702,29917,41921,38600,12415,3098,7811]
[4300000,"46 years - 50 years","46 years - 50 years4300000",38165,43332,85915,64931,20474,4071,11229]
[4300000,"51 years - 55 years","51 years - 55 years4300000",59108,67259,132397,96442,33206,5341,16330]
[4300000,"56 years - 60 years","56 years - 60 years4300000",106271,122243,227733,176700,52367,7655,24258]
[4300000,"61 years - 65 years","61 years - 65 years4300000",149935,176671,364983,238227,86791,11795,41072]
[4300000,"66 years - 70 years","66 years - 70 years4300000",196242,238841,485524,294277,114826,15680,60247]
[4300000,"More than 70 years","More than 70 years4300000",461138,556467,1040180,555843,256848,46799,174876]
[4400000,"91 days - 25 years","91 days - 25 years4400000",4908,6256,9158,3483,3063,1343,2571]
[4400000,"26 years - 30 years","26 years - 30 years4400000",6628,7817,10973,4543,3844,1516,3047]
[4400000,"31 years - 35 years","31 years - 35 years4400000",11001,12237,17192,9409,5464,1898,4092]
[4400000,"36 years - 40 years","36 years - 40 years4400000",15923,17016,23893,19326,8044,2418,5609]
[4400000,"41 years - 45 years","41 years - 45 years4400000",29363,30606,42889,39493,12700,3166,7988]
[4400000,"46 years - 50 years","46 years - 50 years4400000",39046,44333,87907,66433,20946,4161,11486]
[4400000,"51 years - 55 years","51 years - 55 years4400000",60465,68806,135459,98677,33974,5461,16706]
[4400000,"56 years - 60 years","56 years - 60 years4400000",108725,125069,233012,180798,53572,7824,24817]
[4400000,"61 years - 65 years","61 years - 65 years4400000",153405,180763,373454,243755,88796,12060,42022]
[4400000,"66 years - 70 years","66 years - 70 years4400000",200788,244378,496798,301109,117483,16035,61643]
[4400000,"More than 70 years","More than 70 years4400000",471844,569390,1064352,568756,262807,47877,178938]
[4500000,"91 days - 25 years","91 days - 25 years4500000",5015,6394,9363,3558,3128,1369,2625]
[4500000,"26 years - 30 years","26 years - 30 years4500000",6774,7991,11218,4642,3927,1546,3113]
[4500000,"31 years - 35 years","31 years - 35 years4500000",11247,12511,17579,9619,5584,1937,4181]
[4500000,"36 years - 40 years","36 years - 40 years4500000",16281,17399,24432,19761,8222,2469,5732]
[4500000,"41 years - 45 years","41 years - 45 years4500000",30024,31295,43857,40387,12984,3234,8166]
[4500000,"46 years - 50 years","46 years - 50 years4500000",39927,45333,89898,67934,21418,4252,11743]
[4500000,"51 years - 55 years","51 years - 55 years4500000",61823,70353,138521,100911,34742,5582,17081]
[4500000,"56 years - 60 years","56 years - 60 years4500000",111179,127894,238291,184895,54777,7992,25377]
[4500000,"61 years - 65 years","61 years - 65 years4500000",156874,184854,381924,249282,90801,12325,42972]
[4500000,"66 years - 70 years","66 years - 70 years4500000",205334,249914,508072,307940,120140,16390,63040]
[4500000,"More than 70 years","More than 70 years4500000",482550,582313,1088524,581669,268766,48955,183000]
[4600000,"91 days - 25 years","91 days - 25 years4600000",5123,6533,9567,3633,3194,1396,2679]
[4600000,"26 years - 30 years","26 years - 30 years4600000",6921,8164,11463,4741,4010,1577,3178]
[4600000,"31 years - 35 years","31 years - 35 years4600000",11493,12785,17966,9829,5704,1976,4270]
[4600000,"36 years - 40 years","36 years - 40 years4600000",16639,17781,24971,20196,8401,2519,5856]
[4600000,"41 years - 45 years","41 years - 45 years4600000",30684,31984,44825,41280,13269,3302,8343]
[4600000,"46 years - 50 years","46 years - 50 years4600000",40808,46334,91889,69436,21890,4342,12000]
[4600000,"51 years - 55 years","51 years - 55 years4600000",63180,71900,141583,103146,35510,5702,17457]
[4600000,"56 years - 60 years",{"$f":"B515&A515","v":"56 years - 60 years4600000"},113634,130720,243569,188992,55982,8160,25936]
[4600000,"61 years - 65 years","61 years - 65 years4600000",160344,188945,390395,254810,92807,12589,43922]
[4600000,"66 years - 70 years","66 years - 70 years4600000",209880,255451,519345,314771,122797,16745,64436]
[4600000,"More than 70 years","More than 70 years4600000",493256,595236,1112696,594582,274726,50034,187061]
[4700000,"91 days - 25 years","91 days - 25 years4700000",5231,6671,9771,3709,3259,1422,2734]
[4700000,"26 years - 30 years","26 years - 30 years4700000",7068,8338,11709,4841,4094,1607,3243]
[4700000,"31 years - 35 years","31 years - 35 years4700000",11739,13059,18353,10038,5824,2015,4359]
[4700000,"36 years - 40 years","36 years - 40 years4700000",16997,18164,25510,20631,8580,2570,5979]
[4700000,"41 years - 45 years","41 years - 45 years4700000",31345,32673,45793,42174,13553,3370,8521]
[4700000,"46 years - 50 years","46 years - 50 years4700000",41689,47335,93880,70938,22362,4433,12257]
[4700000,"51 years - 55 years","51 years - 55 years4700000",64538,73447,144644,105380,36278,5822,17833]
[4700000,"56 years - 60 years","56 years - 60 years4700000",116088,133545,248848,193090,57186,8329,26495]
[4700000,"61 years - 65 years","61 years - 65 years4700000",163813,193036,398865,260338,94812,12854,44872]
[4700000,"66 years - 70 years","66 years - 70 years4700000",214427,260988,530619,321602,125454,17100,65832]
[4700000,"More than 70 years","More than 70 years4700000",503962,608159,1136868,607495,280685,51112,191123]
[4800000,"91 days - 25 years","91 days - 25 years4800000",5338,6809,9975,3784,3325,1449,2788]
[4800000,"26 years - 30 years","26 years - 30 years4800000",7214,8512,11954,4940,4177,1638,3308]
[4800000,"31 years - 35 years","31 years - 35 years4800000",11985,13333,18739,10248,5945,2054,4448]
[4800000,"36 years - 40 years","36 years - 40 years4800000",17355,18547,26049,21066,8759,2621,6103]
[4800000,"41 years - 45 years","41 years - 45 years4800000",32006,33362,46762,43067,13838,3438,8698]
[4800000,"46 years - 50 years","46 years - 50 years4800000",42569,48336,95872,72440,22834,4523,12514]
[4800000,"51 years - 55 years","51 years - 55 years4800000",65895,74994,147706,107615,37046,5942,18208]
[4800000,"56 years - 60 years","56 years - 60 years4800000",118542,136371,254127,197187,58391,8497,27054]
[4800000,"61 years - 65 years","61 years - 65 years4800000",167283,197128,407336,265866,96817,13119,45823]
[4800000,"66 years - 70 years","66 years - 70 years4800000",218973,266525,541893,328433,128111,17455,67228]
[4800000,"More than 70 years","More than 70 years4800000",514668,621082,1161040,620408,286644,52190,195185]
[4900000,"91 days - 25 years","91 days - 25 years4900000",5446,6947,10179,3859,3391,1475,2843]
[4900000,"26 years - 30 years","26 years - 30 years4900000",7361,8685,12199,5039,4260,1668,3374]
[4900000,"31 years - 35 years","31 years - 35 years4900000",12231,13607,19126,10458,6065,2093,4537]
[4900000,"36 years - 40 years","36 years - 40 years4900000",17713,18930,26588,21502,8938,2672,6226]
[4900000,"41 years - 45 years","41 years - 45 years4900000",32667,34051,47730,43961,14123,3506,8876]
[4900000,"46 years - 50 years","46 years - 50 years4900000",43450,49337,97863,73942,23306,4614,12771]
[4900000,"51 years - 55 years","51 years - 55 years4900000",67253,76541,150768,109850,37814,6062,18584]
[4900000,"56 years - 60 years","56 years - 60 years4900000",120996,139197,259406,201284,59596,8666,27614]
[4900000,"61 years - 65 years","61 years - 65 years4900000",170752,201219,415806,271394,98822,13383,46773]
[4900000,"66 years - 70 years","66 years - 70 years4900000",223519,272062,553166,335265,130768,17810,68624]
[4900000,"More than 70 years","More than 70 years4900000",525374,634005,1185212,633321,292603,53269,199247]
[5000000,"91 days - 25 years","91 days - 25 years5000000",5550,7085,10397,3933,3458,1499,2902]
[5000000,"26 years - 30 years","26 years - 30 years5000000",7506,8858,12435,5138,4343,1698,3437]
[5000000,"31 years - 35 years","31 years - 35 years5000000",12468,13877,19508,10667,6181,2132,4625]
[5000000,"36 years - 40 years","36 years - 40 years5000000",18086,19299,27109,21934,9116,2723,6347]
[5000000,"41 years - 45 years","41 years - 45 years5000000",33325,34738,48696,44851,14404,3573,9047]
[5000000,"46 years - 50 years","46 years - 50 years5000000",44329,50337,99818,75439,23772,4704,13028]
[5000000,"51 years - 55 years","51 years - 55 years5000000",68610,78068,153790,112084,38576,6181,18959]
[5000000,"56 years - 60 years","56 years - 60 years5000000",123447,142017,264682,205382,60793,8825,28171]
[5000000,"61 years - 65 years","61 years - 65 years5000000",174224,205308,424219,276912,100816,13644,47709]
[5000000,"66 years - 70 years","66 years - 70 years5000000",228065,277599,564440,342096,133425,18161,70019]
[5000000,"More than 70 years","More than 70 years5000000",536079,646928,1209381,646234,298558,54355,203306]
[5100000,"91 days - 25 years","91 days - 25 years5100000",5661,7223,10587,4009,3522,1528,2952]
[5100000,"26 years - 30 years","26 years - 30 years5100000",7654,9032,12690,5238,4427,1729,3504]
[5100000,"31 years - 35 years","31 years - 35 years5100000",12723,14155,19900,10878,6305,2171,4715]
[5100000,"36 years - 40 years","36 years - 40 years5100000",18428,19695,27666,22372,9295,2774,6473]
[5100000,"41 years - 45 years","41 years - 45 years5100000",33988,35429,49666,45748,14692,3642,9231]
[5100000,"46 years - 50 years","46 years - 50 years5100000",45212,51339,101846,76946,24250,4795,13285]
[5100000,"51 years - 55 years","51 years - 55 years5100000",69967,79635,156892,114319,39351,6302,19335]
[5100000,"56 years - 60 years","56 years - 60 years5100000",125905,144848,269964,209479,62006,9003,28732]
[5100000,"61 years - 65 years","61 years - 65 years5100000",177691,209401,432747,282450,102833,13912,48673]
[5100000,"66 years - 70 years","66 years - 70 years5100000",232612,283136,575713,348927,136082,18520,71416]
[5100000,"More than 70 years","More than 70 years5100000",546785,659851,1233556,659147,304521,55425,207370]
[5200000,"91 days - 25 years","91 days - 25 years5200000",5768,7362,10792,4084,3587,1555,3006]
[5200000,"26 years - 30 years","26 years - 30 years5200000",7801,9206,12936,5337,4510,1759,3569]
[5200000,"31 years - 35 years","31 years - 35 years5200000",12969,14429,20286,11087,6425,2210,4804]
[5200000,"36 years - 40 years","36 years - 40 years5200000",18786,20078,28205,22807,9474,2825,6596]
[5200000,"41 years - 45 years","41 years - 45 years5200000",34649,36118,50634,46642,14976,3710,9408]
[5200000,"46 years - 50 years",{"$f":"B579&A579","v":"46 years - 50 years5200000"},46093,52340,103837,78448,24722,4886,13542]
[5200000,"51 years - 55 years","51 years - 55 years5200000",71325,81182,159954,116554,40119,6422,19711]
[5200000,"56 years - 60 years","56 years - 60 years5200000",128359,147674,275242,213576,63210,9171,29291]
[5200000,"61 years - 65 years","61 years - 65 years5200000",181161,213493,441218,287978,104838,14177,49623]
[5200000,"66 years - 70 years","66 years - 70 years5200000",237158,288673,586987,355758,138739,18875,72813]
[5200000,"More than 70 years","More than 70 years5200000",557491,672774,1257728,672060,310480,56504,211432]
[5300000,"91 days - 25 years","91 days - 25 years5300000",5876,7500,10996,4159,3653,1581,3060]
[5300000,"26 years - 30 years","26 years - 30 years5300000",7947,9380,13181,5436,4594,1790,3635]
[5300000,"31 years - 35 years","31 years - 35 years5300000",13215,14704,20673,11297,6545,2250,4893]
[5300000,"36 years - 40 years","36 years - 40 years5300000",19144,20461,28744,23242,9653,2876,6720]
[5300000,"41 years - 45 years","41 years - 45 years5300000",35310,36807,51602,47535,15261,3778,9586]
[5300000,"46 years - 50 years","46 years - 50 years5300000",46974,53341,105828,79949,25194,4976,13799]
[5300000,"51 years - 55 years","51 years - 55 years5300000",72682,82729,163016,118788,40887,6542,20086]
[5300000,"56 years - 60 years","56 years - 60 years5300000",130813,150499,280521,217673,64415,9340,29850]
[5300000,"61 years - 65 years","61 years - 65 years5300000",184630,217584,449688,293506,106843,14442,50574]
[5300000,"66 years - 70 years","66 years - 70 years5300000",241704,294210,598261,362590,141396,19230,74209]
[5300000,"More than 70 years","More than 70 years5300000",568197,685697,1281900,684973,316439,57582,215494]
[5400000,"91 days - 25 years","91 days - 25 years5400000",5983,7638,11200,4235,3719,1608,3115]
[5400000,"26 years - 30 years","26 years - 30 years5400000",8094,9553,13426,5535,4677,1820,3700]
[5400000,"31 years - 35 years","31 years - 35 years5400000",13461,14978,21060,11507,6666,2289,4982]
[5400000,"36 years - 40 years","36 years - 40 years5400000",19502,20843,29283,23678,9832,2927,6843]
[5400000,"41 years - 45 years","41 years - 45 years5400000",35970,37496,52571,48429,15546,3845,9763]
[5400000,"46 years - 50 years","46 years - 50 years5400000",47854,54342,107819,81451,25666,5067,14057]
[5400000,"51 years - 55 years","51 years - 55 years5400000",74040,84276,166077,121023,41655,6662,20462]
[5400000,"56 years - 60 years","56 years - 60 years5400000",133267,153325,285800,221771,65620,9508,30410]
[5400000,"61 years - 65 years","61 years - 65 years5400000",188100,221675,458159,299034,108848,14706,51524]
[5400000,"66 years - 70 years","66 years - 70 years5400000",246250,299747,609534,369421,144053,19585,75605]
[5400000,"More than 70 years","More than 70 years5400000",578903,698619,1306072,697886,322398,58660,219555]
[5500000,"91 days - 25 years","91 days - 25 years5500000",6091,7776,11404,4310,3784,1634,3169]
[5500000,"26 years - 30 years","26 years - 30 years5500000",8241,9727,13672,5635,4760,1851,3765]
[5500000,"31 years - 35 years","31 years - 35 years5500000",13707,15252,21446,11717,6786,2328,5071]
[5500000,"36 years - 40 years","36 years - 40 years5500000",19860,21226,29822,24113,10010,2978,6967]
[5500000,"41 years - 45 years","41 years - 45 years5500000",36631,38185,53539,49322,15830,3913,9941]
[5500000,"46 years - 50 years","46 years - 50 years5500000",48735,55343,109811,82953,26138,5157,14314]
[5500000,"51 years - 55 years","51 years - 55 years5500000",75397,85823,169139,123258,42423,6783,20838]
[5500000,"56 years - 60 years","56 years - 60 years5500000",135721,156151,291079,225868,66825,9676,30969]
[5500000,"61 years - 65 years","61 years - 65 years5500000",191570,225767,466629,304562,110853,14971,52474]
[5500000,"66 years - 70 years","66 years - 70 years5500000",250797,305283,620808,376252,146710,19939,77001]
[5500000,"More than 70 years","More than 70 years5500000",589609,711542,1330244,710799,328357,59739,223617]
[5600000,"91 days - 25 years","91 days - 25 years5600000",6198,7914,11608,4385,3850,1661,3224]
[5600000,"26 years - 30 years","26 years - 30 years5600000",8387,9901,13917,5734,4844,1881,3830]
[5600000,"31 years - 35 years","31 years - 35 years5600000",13953,15526,21833,11927,6906,2367,5160]
[5600000,"36 years - 40 years","36 years - 40 years5600000",20218,21609,30361,24548,10189,3029,7090]
[5600000,"41 years - 45 years","41 years - 45 years5600000",37292,38874,54507,50216,16115,3981,10118]
[5600000,"46 years - 50 years","46 years - 50 years5600000",49616,56344,111802,84455,26610,5248,14571]
[5600000,"51 years - 55 years","51 years - 55 years5600000",76755,87370,172201,125492,43191,6903,21213]
[5600000,"56 years - 60 years","56 years - 60 years5600000",138176,158976,296358,229965,68030,9845,31528]
[5600000,"61 years - 65 years","61 years - 65 years5600000",195039,229858,475100,310090,112859,15236,53424]
[5600000,"66 years - 70 years","66 years - 70 years5600000",255343,310820,632081,383083,149367,20294,78397]
[5600000,"More than 70 years","More than 70 years5600000",600315,724465,1354416,723712,334317,60817,227679]
[5700000,"91 days - 25 years","91 days - 25 years5700000",6306,8053,11812,4460,3915,1687,3278]
[5700000,"26 years - 30 years","26 years - 30 years5700000",8534,10074,14162,5833,4927,1912,3896]
[5700000,"31 years - 35 years","31 years - 35 years5700000",14199,15800,22220,12137,7026,2406,5249]
[5700000,"36 years - 40 years","36 years - 40 years5700000",20576,21991,30900,24983,10368,3080,7214]
[5700000,"41 years - 45 years","41 years - 45 years5700000",37953,39563,55475,51109,16399,4049,10296]
[5700000,"46 years - 50 years","46 years - 50 years5700000",50497,57345,113793,85957,27082,5338,14828]
[5700000,"51 years - 55 years","51 years - 55 years5700000",78112,88917,175263,127727,43959,7023,21589]
[5700000,"56 years - 60 years","56 years - 60 years5700000",140630,161802,301637,234063,69234,10013,32087]
[5700000,"61 years - 65 years","61 years - 65 years5700000",198509,233949,483570,315618,114864,15500,54375]
[5700000,"66 years - 70 years","66 years - 70 years5700000",259889,316357,643355,389914,152024,20649,79793]
[5700000,"More than 70 years","More than 70 years5700000",611021,737388,1378587,736626,340276,61895,231741]
[5800000,"91 days - 25 years","91 days - 25 years5800000",6413,8191,12016,4535,3981,1714,3332]
[5800000,"26 years - 30 years","26 years - 30 years5800000",8680,10248,14408,5932,5010,1942,3961]
[5800000,"31 years - 35 years","31 years - 35 years5800000",14445,16074,22607,12346,7146,2445,5338]
[5800000,"36 years - 40 years",{"$f":"B643&A643","v":"36 years - 40 years5800000"},20934,22374,31439,25418,10547,3131,7337]
[5800000,"41 years - 45 years","41 years - 45 years5800000",38613,40252,56443,52003,16684,4117,10474]
[5800000,"46 years - 50 years","46 years - 50 years5800000",51378,58346,115785,87459,27554,5429,15085]
[5800000,"51 years - 55 years","51 years - 55 years5800000",79470,90464,178325,129962,44727,7143,21965]
[5800000,"56 years - 60 years","56 years - 60 years5800000",143084,164627,306915,238160,70439,10182,32647]
[5800000,"61 years - 65 years","61 years - 65 years5800000",201978,238040,492041,321145,116869,15765,55325]
[5800000,"66 years - 70 years","66 years - 70 years5800000",264435,321894,654629,396746,154681,21004,81189]
[5800000,"More than 70 years","More than 70 years5800000",621727,750311,1402759,749539,346235,62974,235802]
[5900000,"91 days - 25 years","91 days - 25 years5900000",6521,8329,12221,4610,4047,1740,3387]
[5900000,"26 years - 30 years","26 years - 30 years5900000",8827,10422,14653,6032,5094,1972,4026]
[5900000,"31 years - 35 years","31 years - 35 years5900000",14691,16348,22993,12556,7267,2484,5427]
[5900000,"36 years - 40 years","36 years - 40 years5900000",21291,22757,31978,25854,10725,3182,7461]
[5900000,"41 years - 45 years","41 years - 45 years5900000",39274,40941,57411,52897,16969,4185,10651]
[5900000,"46 years - 50 years","46 years - 50 years5900000",52259,59347,117776,88961,28026,5519,15342]
[5900000,"51 years - 55 years","51 years - 55 years5900000",80827,92011,181387,132196,45495,7263,22340]
[5900000,"56 years - 60 years","56 years - 60 years5900000",145538,167453,312194,242257,71644,10350,33206]
[5900000,"61 years - 65 years","61 years - 65 years5900000",205448,242132,500511,326673,118874,16030,56275]
[5900000,"66 years - 70 years","66 years - 70 years5900000",268982,327431,665902,403577,157338,21359,82585]
[5900000,"More than 70 years","More than 70 years5900000",632433,763234,1426931,762452,352194,64052,239864]
[6000000,"91 days - 25 years","91 days - 25 years6000000",6628,8467,12425,4685,4112,1767,3441]
[6000000,"26 years - 30 years","26 years - 30 years6000000",8974,10595,14898,6131,5177,2003,4091]
[6000000,"31 years - 35 years","31 years - 35 years6000000",14937,16622,23380,12766,7387,2523,5516]
[6000000,"36 years - 40 years","36 years - 40 years6000000",21649,23140,32517,26289,10904,3233,7584]
[6000000,"41 years - 45 years","41 years - 45 years6000000",39935,41630,58380,53790,17253,4253,10829]
[6000000,"46 years - 50 years","46 years - 50 years6000000",53139,60348,119767,90463,28498,5610,15599]
[6000000,"51 years - 55 years","51 years - 55 years6000000",82185,93558,184449,134431,46263,7383,22716]
[6000000,"56 years - 60 years","56 years - 60 years6000000",147992,170279,317473,246355,72849,10519,33765]
[6000000,"61 years - 65 years","61 years - 65 years6000000",208917,246223,508982,332201,120879,16294,57225]
[6000000,"66 years - 70 years","66 years - 70 years6000000",273528,332968,677176,410408,159995,21714,83982]
[6000000,"More than 70 years","More than 70 years6000000",643139,776157,1451103,775365,358153,65130,243926]
[6100000,"91 days - 25 years","91 days - 25 years6100000",6736,8605,12629,4761,4178,1793,3496]
[6100000,"26 years - 30 years","26 years - 30 years6100000",9120,10769,15144,6230,5260,2033,4157]
[6100000,"31 years - 35 years","31 years - 35 years6100000",15183,16896,23767,12976,7507,2563,5605]
[6100000,"36 years - 40 years","36 years - 40 years6100000",22007,23522,33056,26724,11083,3283,7707]
[6100000,"41 years - 45 years","41 years - 45 years6100000",40596,42319,59348,54684,17538,4321,11006]
[6100000,"46 years - 50 years","46 years - 50 years6100000",54020,61349,121758,91965,28970,5701,15856]
[6100000,"51 years - 55 years","51 years - 55 years6100000",83542,95106,187510,136665,47031,7503,23092]
[6100000,"56 years - 60 years","56 years - 60 years6100000",150447,173104,322752,250452,74053,10687,34324]
[6100000,"61 years - 65 years","61 years - 65 years6100000",212387,250314,517452,337729,122885,16559,58175]
[6100000,"66 years - 70 years","66 years - 70 years6100000",278074,338505,688450,417239,162652,22069,85378]
[6100000,"More than 70 years","More than 70 years6100000",653845,789080,1475275,788278,364112,66209,247988]
[6200000,"91 days - 25 years","91 days - 25 years6200000",6844,8743,12833,4836,4243,1820,3550]
[6200000,"26 years - 30 years","26 years - 30 years6200000",9267,10943,15389,6329,5344,2064,4222]
[6200000,"31 years - 35 years","31 years - 35 years6200000",15429,17170,24154,13186,7627,2602,5694]
[6200000,"36 years - 40 years","36 years - 40 years6200000",22365,23905,33595,27159,11262,3334,7831]
[6200000,"41 years - 45 years","41 years - 45 years6200000",41256,43008,60316,55577,17822,4389,11184]
[6200000,"46 years - 50 years","46 years - 50 years6200000",54901,62350,123750,93466,29442,5791,16113]
[6200000,"51 years - 55 years","51 years - 55 years6200000",84900,96653,190572,138900,47800,7623,23467]
[6200000,"56 years - 60 years","56 years - 60 years6200000",152901,175930,328031,254549,75258,10855,34884]
[6200000,"61 years - 65 years","61 years - 65 years6200000",215856,254405,525923,343257,124890,16824,59126]
[6200000,"66 years - 70 years","66 years - 70 years6200000",282620,344042,699723,424070,165309,22424,86774]
[6200000,"More than 70 years","More than 70 years6200000",664551,802003,1499447,801191,370071,67287,252049]
[6300000,"91 days - 25 years","91 days - 25 years6300000",6951,8882,13037,4911,4309,1846,3604]
[6300000,"26 years - 30 years","26 years - 30 years6300000",9414,11116,15635,6428,5427,2094,4287]
[6300000,"31 years - 35 years","31 years - 35 years6300000",15675,17444,24540,13396,7747,2641,5783]
[6300000,"36 years - 40 years","36 years - 40 years6300000",22723,24288,34134,27594,11441,3385,7954]
[6300000,"41 years - 45 years","41 years - 45 years6300000",41917,43697,61284,56471,18107,4457,11361]
[6300000,"46 years - 50 years","46 years - 50 years6300000",55782,63351,125741,94968,29914,5882,16370]
[6300000,"51 years - 55 years","51 years - 55 years6300000",86257,98200,193634,141135,48568,7743,23843]
[6300000,"56 years - 60 years","56 years - 60 years6300000",155355,178756,333310,258647,76463,11024,35443]
[6300000,"61 years - 65 years","61 years - 65 years6300000",219326,258497,534393,348785,126895,17088,60076]
[6300000,"66 years - 70 years","66 years - 70 years6300000",287167,349579,710997,430902,167966,22779,88170]
[6300000,"More than 70 years","More than 70 years6300000",675257,814926,1523619,814104,376030,68365,256111]
[6400000,"91 days - 25 years","91 days - 25 years6400000",7059,9020,13241,4986,4374,1873,3659]
[6400000,"26 years - 30 years",{"$f":"B707&A707","v":"26 years - 30 years6400000"},9560,11290,15880,6528,5510,2125,4352]
[6400000,"31 years - 35 years","31 years - 35 years6400000",15921,17719,24927,13605,7867,2680,5872]
[6400000,"36 years - 40 years","36 years - 40 years6400000",23081,24670,34673,28030,11619,3436,8078]
[6400000,"41 years - 45 years","41 years - 45 years6400000",42578,44386,62252,57364,18392,4525,11539]
[6400000,"46 years - 50 years","46 years - 50 years6400000",56663,64352,127732,96470,30386,5972,16627]
[6400000,"51 years - 55 years","51 years - 55 years6400000",87615,99747,196696,143369,49336,7863,24218]
[6400000,"56 years - 60 years","56 years - 60 years6400000",157809,181581,338588,262744,77668,11192,36002]
[6400000,"61 years - 65 years","61 years - 65 years6400000",222795,262588,542864,354313,128900,17353,61026]
[6400000,"66 years - 70 years","66 years - 70 years6400000",291713,355116,722270,437733,170623,23134,89566]
[6400000,"More than 70 years","More than 70 years6400000",685963,827848,1547791,827017,381989,69444,260173]
[6500000,"91 days - 25 years","91 days - 25 years6500000",7166,9158,13445,5061,4440,1899,3713]
[6500000,"26 years - 30 years","26 years - 30 years6500000",9707,11464,16125,6627,5594,2155,4418]
[6500000,"31 years - 35 years","31 years - 35 years6500000",16167,17993,25314,13815,7988,2719,5961]
[6500000,"36 years - 40 years","36 years - 40 years6500000",23439,25053,35212,28465,11798,3487,8201]
[6500000,"41 years - 45 years","41 years - 45 years6500000",43239,45075,63221,58258,18676,4593,11716]
[6500000,"46 years - 50 years","46 years - 50 years6500000",57543,65353,129724,97972,30858,6063,16884]
[6500000,"51 years - 55 years","51 years - 55 years6500000",88972,101294,199758,145604,50104,7983,24594]
[6500000,"56 years - 60 years","56 years - 60 years6500000",160264,184407,343867,266841,78873,11361,36561]
[6500000,"61 years - 65 years","61 years - 65 years6500000",226265,266679,551334,359841,130905,17618,61976]
[6500000,"66 years - 70 years","66 years - 70 years6500000",296259,360653,733544,444564,173280,23489,90962]
[6500000,"More than 70 years","More than 70 years6500000",696669,840771,1571963,839930,387948,70522,264235]
[6600000,"91 days - 25 years","91 days - 25 years6600000",7274,9296,13650,5136,4506,1926,3768]
[6600000,"26 years - 30 years","26 years - 30 years6600000",9853,11637,16371,6726,5677,2185,4483]
[6600000,"31 years - 35 years","31 years - 35 years6600000",16413,18267,25700,14025,8108,2758,6050]
[6600000,"36 years - 40 years","36 years - 40 years6600000",23797,25436,35751,28900,11977,3538,8325]
[6600000,"41 years - 45 years","41 years - 45 years6600000",43900,45764,64189,59151,18961,4661,11894]
[6600000,"46 years - 50 years","46 years - 50 years6600000",58424,66354,131715,99474,31330,6153,17141]
[6600000,"51 years - 55 years","51 years - 55 years6600000",90330,102841,202820,147839,50872,8104,24970]
[6600000,"56 years - 60 years","56 years - 60 years6600000",162718,187233,349146,270938,80077,11529,37121]
[6600000,"61 years - 65 years","61 years - 65 years6600000",229734,270771,559805,365369,132911,17882,62927]
[6600000,"66 years - 70 years","66 years - 70 years6600000",300805,366189,744818,451395,175937,23844,92358]
[6600000,"More than 70 years","More than 70 years6600000",707375,853694,1596135,852843,393908,71600,268296]
[6700000,"91 days - 25 years","91 days - 25 years6700000",7381,9434,13854,5211,4571,1952,3822]
[6700000,"26 years - 30 years","26 years - 30 years6700000",10000,11811,16616,6825,5760,2216,4548]
[6700000,"31 years - 35 years","31 years - 35 years6700000",16659,18541,26087,14235,8228,2797,6139]
[6700000,"36 years - 40 years","36 years - 40 years6700000",24154,25819,36290,29335,12156,3589,8448]
[6700000,"41 years - 45 years","41 years - 45 years6700000",44560,46453,65157,60045,19245,4729,12071]
[6700000,"46 years - 50 years","46 years - 50 years6700000",59305,67355,133706,100976,31802,6244,17398]
[6700000,"51 years - 55 years","51 years - 55 years6700000",91687,104388,205881,150073,51640,8224,25345]
[6700000,"56 years - 60 years","56 years - 60 years6700000",165172,190058,354425,275036,81282,11698,37680]
[6700000,"61 years - 65 years","61 years - 65 years6700000",233204,274862,568275,370897,134916,18147,63877]
[6700000,"66 years - 70 years","66 years - 70 years6700000",305352,371726,756091,458226,178594,24199,93755]
[6700000,"More than 70 years","More than 70 years6700000",718081,866617,1620307,865756,399867,72679,272358]
[6800000,"91 days - 25 years","91 days - 25 years6800000",7489,9573,14058,5287,4637,1979,3877]
[6800000,"26 years - 30 years","26 years - 30 years6800000",10147,11985,16861,6925,5844,2246,4613]
[6800000,"31 years - 35 years","31 years - 35 years6800000",16905,18815,26474,14445,8348,2836,6228]
[6800000,"36 years - 40 years","36 years - 40 years6800000",24512,26201,36829,29771,12335,3640,8572]
[6800000,"41 years - 45 years","41 years - 45 years6800000",45221,47142,66125,60939,19530,4797,12249]
[6800000,"46 years - 50 years","46 years - 50 years6800000",60186,68356,135697,102478,32274,6334,17655]
[6800000,"51 years - 55 years","51 years - 55 years6800000",93045,105935,208943,152308,52408,8344,25721]
[6800000,"56 years - 60 years","56 years - 60 years6800000",167626,192884,359704,279133,82487,11866,38239]
[6800000,"61 years - 65 years","61 years - 65 years6800000",236673,278953,576746,376425,136921,18412,64827]
[6800000,"66 years - 70 years","66 years - 70 years6800000",309898,377263,767365,465058,181251,24554,95151]
[6800000,"More than 70 years","More than 70 years6800000",728787,879540,1644479,878669,405826,73757,276420]
[6900000,"91 days - 25 years","91 days - 25 years6900000",7596,9711,14262,5362,4702,2005,3931]
[6900000,"26 years - 30 years","26 years - 30 years6900000",10293,12158,17107,7024,5927,2277,4679]
[6900000,"31 years - 35 years","31 years - 35 years6900000",17151,19089,26861,14655,8468,2875,6317]
[6900000,"36 years - 40 years","36 years - 40 years6900000",24870,26584,37368,30206,12513,3691,8695]
[6900000,"41 years - 45 years","41 years - 45 years6900000",45882,47831,67093,61832,19815,4865,12426]
[6900000,"46 years - 50 years","46 years - 50 years6900000",61067,69357,137689,103980,32746,6425,17912]
[6900000,"51 years - 55 years","51 years - 55 years6900000",94402,107482,212005,154543,53176,8464,26097]
[6900000,"56 years - 60 years","56 years - 60 years6900000",170080,195709,364983,283230,83692,12034,38798]
[6900000,"61 years - 65 years","61 years - 65 years6900000",240143,283044,585216,381953,138926,18676,65777]
[6900000,"66 years - 70 years","66 years - 70 years6900000",314444,382800,778638,471889,183908,24909,96547]
[6900000,"More than 70 years",{"$f":"B771&A771","v":"More than 70 years6900000"},739493,892463,1668651,891582,411785,74835,280482]
[7000000,"91 days - 25 years","91 days - 25 years7000000",7704,9849,14466,5437,4768,2032,3985]
[7000000,"26 years - 30 years","26 years - 30 years7000000",10440,12332,17352,7123,6010,2307,4744]
[7000000,"31 years - 35 years","31 years - 35 years7000000",17397,19363,27247,14864,8588,2915,6406]
[7000000,"36 years - 40 years","36 years - 40 years7000000",25228,26967,37907,30641,12692,3742,8819]
[7000000,"41 years - 45 years","41 years - 45 years7000000",46543,48520,68061,62726,20099,4933,12604]
[7000000,"46 years - 50 years","46 years - 50 years7000000",61948,70358,139680,105481,33218,6516,18169]
[7000000,"51 years - 55 years","51 years - 55 years7000000",95760,109029,215067,156777,53944,8584,26472]
[7000000,"56 years - 60 years","56 years - 60 years7000000",172535,198535,370261,287328,84896,12203,39358]
[7000000,"61 years - 65 years","61 years - 65 years7000000",243612,287136,593687,387481,140931,18941,66727]
[7000000,"66 years - 70 years","66 years - 70 years7000000",318990,388337,789912,478720,186565,25263,97943]
[7000000,"More than 70 years","More than 70 years7000000",750199,905386,1692823,904495,417744,75914,284543]
[7100000,"91 days - 25 years","91 days - 25 years7100000",7811,9987,14670,5512,4834,2058,4040]
[7100000,"26 years - 30 years","26 years - 30 years7100000",10587,12505,17598,7222,6094,2338,4809]
[7100000,"31 years - 35 years","31 years - 35 years7100000",17643,19637,27634,15074,8709,2954,6495]
[7100000,"36 years - 40 years","36 years - 40 years7100000",25586,27349,38446,31076,12871,3793,8942]
[7100000,"41 years - 45 years","41 years - 45 years7100000",47203,49209,69030,63619,20384,5000,12781]
[7100000,"46 years - 50 years","46 years - 50 years7100000",62828,71359,141671,106983,33690,6606,18426]
[7100000,"51 years - 55 years","51 years - 55 years7100000",97117,110576,218129,159012,54712,8704,26848]
[7100000,"56 years - 60 years","56 years - 60 years7100000",174989,201361,375540,291425,86101,12371,39917]
[7100000,"61 years - 65 years","61 years - 65 years7100000",247082,291227,602157,393009,142937,19206,67678]
[7100000,"66 years - 70 years","66 years - 70 years7100000",323537,393874,801186,485551,189222,25618,99339]
[7100000,"More than 70 years","More than 70 years7100000",760905,918309,1716995,917408,423703,76992,288605]
[7200000,"91 days - 25 years","91 days - 25 years7200000",7919,10125,14874,5587,4899,2085,4094]
[7200000,"26 years - 30 years","26 years - 30 years7200000",10733,12679,17843,7322,6177,2368,4874]
[7200000,"31 years - 35 years","31 years - 35 years7200000",17889,19911,28021,15284,8829,2993,6584]
[7200000,"36 years - 40 years","36 years - 40 years7200000",25944,27732,38985,31511,13050,3844,9065]
[7200000,"41 years - 45 years","41 years - 45 years7200000",47864,49898,69998,64513,20669,5068,12959]
[7200000,"46 years - 50 years","46 years - 50 years7200000",63709,72360,143663,108485,34162,6697,18683]
[7200000,"51 years - 55 years","51 years - 55 years7200000",98475,112123,221191,161247,55481,8824,27224]
[7200000,"56 years - 60 years","56 years - 60 years7200000",177443,204186,380819,295522,87306,12540,40476]
[7200000,"61 years - 65 years","61 years - 65 years7200000",250551,295318,610628,398536,144942,19470,68628]
[7200000,"66 years - 70 years","66 years - 70 years7200000",328083,399411,812459,492382,191879,25973,100735]
[7200000,"More than 70 years","More than 70 years7200000",771610,931232,1741167,930321,429662,78070,292667]
[7300000,"91 days - 25 years","91 days - 25 years7300000",8026,10263,15078,5662,4965,2111,4149]
[7300000,"26 years - 30 years","26 years - 30 years7300000",10880,12853,18088,7421,6260,2399,4939]
[7300000,"31 years - 35 years","31 years - 35 years7300000",18135,20185,28408,15494,8949,3032,6673]
[7300000,"36 years - 40 years","36 years - 40 years7300000",26302,28115,39524,31947,13229,3895,9189]
[7300000,"41 years - 45 years","41 years - 45 years7300000",48525,50587,70966,65406,20953,5136,13136]
[7300000,"46 years - 50 years","46 years - 50 years7300000",64590,73361,145654,109987,34634,6787,18940]
[7300000,"51 years - 55 years","51 years - 55 years7300000",99832,113670,224253,163481,56249,8944,27599]
[7300000,"56 years - 60 years","56 years - 60 years7300000",179897,207012,386098,299620,88511,12708,41035]
[7300000,"61 years - 65 years","61 years - 65 years7300000",254021,299409,619099,404064,146947,19735,69578]
[7300000,"66 years - 70 years","66 years - 70 years7300000",332629,404948,823733,499214,194536,26328,102131]
[7300000,"More than 70 years","More than 70 years7300000",782316,944155,1765339,943234,435621,79149,296729]
[7400000,"91 days - 25 years","91 days - 25 years7400000",8134,10402,15283,5738,5030,2138,4203]
[7400000,"26 years - 30 years","26 years - 30 years7400000",11026,13026,18334,7520,6344,2429,5005]
[7400000,"31 years - 35 years","31 years - 35 years7400000",18381,20460,28794,15704,9069,3071,6762]
[7400000,"36 years - 40 years","36 years - 40 years7400000",26660,28498,40063,32382,13407,3946,9312]
[7400000,"41 years - 45 years","41 years - 45 years7400000",49186,51276,71934,66300,21238,5204,13314]
[7400000,"46 years - 50 years","46 years - 50 years7400000",65471,74362,147645,111489,35106,6878,19197]
[7400000,"51 years - 55 years","51 years - 55 years7400000",101190,115217,227314,165716,57017,9064,27975]
[7400000,"56 years - 60 years","56 years - 60 years7400000",182351,209838,391377,303717,89716,12877,41595]
[7400000,"61 years - 65 years","61 years - 65 years7400000",257490,303501,627569,409592,148952,20000,70528]
[7400000,"66 years - 70 years","66 years - 70 years7400000",337175,410485,835006,506045,197193,26683,103527]
[7400000,"More than 70 years","More than 70 years7400000",793022,957077,1789511,956147,441580,80227,300790]
[7500000,"91 days - 25 years","91 days - 25 years7500000",8241,10540,15487,5813,5096,2164,4257]
[7500000,"26 years - 30 years","26 years - 30 years7500000",11173,13200,18579,7619,6427,2459,5070]
[7500000,"31 years - 35 years","31 years - 35 years7500000",18627,20734,29181,15913,9189,3110,6851]
[7500000,"36 years - 40 years","36 years - 40 years7500000",27018,28880,40602,32817,13586,3996,9436]
[7500000,"41 years - 45 years","41 years - 45 years7500000",49846,51965,72902,67193,21522,5272,13492]
[7500000,"46 years - 50 years","46 years - 50 years7500000",66352,75363,149636,112991,35578,6968,19454]
[7500000,"51 years - 55 years","51 years - 55 years7500000",102547,116764,230376,167950,57785,9184,28350]
[7500000,"56 years - 60 years","56 years - 60 years7500000",184806,212663,396655,307814,90920,13045,42154]
[7500000,"61 years - 65 years",{"$f":"B835&A835","v":"61 years - 65 years7500000"},260960,307592,636040,415120,150957,20264,71479]
[7500000,"66 years - 70 years","66 years - 70 years7500000",341722,416022,846280,512876,199850,27038,104924]
[7500000,"More than 70 years","More than 70 years7500000",803728,970000,1813683,969061,447539,81305,304852]
[7600000,"91 days - 25 years","91 days - 25 years7600000",8349,10678,15691,5888,5162,2191,4312]
[7600000,"26 years - 30 years","26 years - 30 years7600000",11320,13374,18824,7719,6510,2490,5135]
[7600000,"31 years - 35 years","31 years - 35 years7600000",18873,21008,29568,16123,9309,3149,6940]
[7600000,"36 years - 40 years","36 years - 40 years7600000",27375,29263,41141,33252,13765,4047,9559]
[7600000,"41 years - 45 years","41 years - 45 years7600000",50507,52654,73870,68087,21807,5340,13669]
[7600000,"46 years - 50 years","46 years - 50 years7600000",67233,76364,151628,114493,36050,7059,19711]
[7600000,"51 years - 55 years","51 years - 55 years7600000",103905,118311,233438,170185,58553,9304,28726]
[7600000,"56 years - 60 years","56 years - 60 years7600000",187260,215489,401934,311912,92125,13213,42713]
[7600000,"61 years - 65 years","61 years - 65 years7600000",264429,311683,644510,420648,152963,20529,72429]
[7600000,"66 years - 70 years","66 years - 70 years7600000",346268,421558,857554,519707,202507,27393,106320]
[7600000,"More than 70 years","More than 70 years7600000",814434,982923,1837855,981974,453499,82384,308914]
[7700000,"91 days - 25 years","91 days - 25 years7700000",8457,10816,15895,5963,5227,2217,4366]
[7700000,"26 years - 30 years","26 years - 30 years7700000",11466,13547,19070,7818,6594,2520,5200]
[7700000,"31 years - 35 years","31 years - 35 years7700000",19119,21282,29954,16333,9430,3188,7029]
[7700000,"36 years - 40 years","36 years - 40 years7700000",27733,29646,41680,33687,13944,4098,9683]
[7700000,"41 years - 45 years","41 years - 45 years7700000",51168,53343,74839,68981,22092,5408,13847]
[7700000,"46 years - 50 years","46 years - 50 years7700000",68113,77365,153619,115995,36522,7149,19968]
[7700000,"51 years - 55 years","51 years - 55 years7700000",105262,119858,236500,172420,59321,9425,29102]
[7700000,"56 years - 60 years","56 years - 60 years7700000",189714,218315,407213,316009,93330,13382,43272]
[7700000,"61 years - 65 years","61 years - 65 years7700000",267899,315774,652981,426176,154968,20793,73379]
[7700000,"66 years - 70 years","66 years - 70 years7700000",350814,427095,868827,526538,205164,27748,107716]
[7700000,"More than 70 years","More than 70 years7700000",825140,995846,1862027,994887,459458,83462,312976]
[7800000,"91 days - 25 years","91 days - 25 years7800000",8564,10954,16099,6038,5293,2244,4421]
[7800000,"26 years - 30 years","26 years - 30 years7800000",11613,13721,19315,7917,6677,2551,5266]
[7800000,"31 years - 35 years","31 years - 35 years7800000",19365,21556,30341,16543,9550,3227,7118]
[7800000,"36 years - 40 years","36 years - 40 years7800000",28091,30028,42219,34123,14123,4149,9806]
[7800000,"41 years - 45 years","41 years - 45 years7800000",51829,54032,75807,69874,22376,5476,14024]
[7800000,"46 years - 50 years","46 years - 50 years7800000",68994,78366,155610,117497,36994,7240,20225]
[7800000,"51 years - 55 years","51 years - 55 years7800000",106620,121405,239562,174654,60089,9545,29477]
[7800000,"56 years - 60 years","56 years - 60 years7800000",192168,221140,412492,320106,94535,13550,43832]
[7800000,"61 years - 65 years","61 years - 65 years7800000",271368,319866,661451,431704,156973,21058,74329]
[7800000,"66 years - 70 years","66 years - 70 years7800000",355360,432632,880101,533370,207821,28103,109112]
[7800000,"More than 70 years","More than 70 years7800000",835846,1008769,1886199,1007800,465417,84540,317037]
[7900000,"91 days - 25 years","91 days - 25 years7900000",8672,11092,16303,6113,5358,2270,4475]
[7900000,"26 years - 30 years","26 years - 30 years7900000",11760,13895,19560,8016,6760,2581,5331]
[7900000,"31 years - 35 years","31 years - 35 years7900000",19611,21830,30728,16753,9670,3267,7207]
[7900000,"36 years - 40 years","36 years - 40 years7900000",28449,30411,42758,34558,14301,4200,9930]
[7900000,"41 years - 45 years","41 years - 45 years7900000",52489,54721,76775,70768,22661,5544,14202]
[7900000,"46 years - 50 years","46 years - 50 years7900000",69875,79366,157602,118998,37466,7331,20482]
[7900000,"51 years - 55 years","51 years - 55 years7900000",107977,122952,242624,176889,60857,9665,29853]
[7900000,"56 years - 60 years","56 years - 60 years7900000",194622,223966,417771,324204,95740,13719,44391]
[7900000,"61 years - 65 years","61 years - 65 years7900000",274838,323957,669922,437232,158978,21323,75279]
[7900000,"66 years - 70 years","66 years - 70 years7900000",359907,438169,891375,540201,210478,28458,110508]
[7900000,"More than 70 years","More than 70 years7900000",846552,1021692,1910371,1020713,471376,85619,321099]
[8000000,"91 days - 25 years","91 days - 25 years8000000",8779,11231,16507,6188,5424,2297,4529]
[8000000,"26 years - 30 years","26 years - 30 years8000000",11906,14068,19806,8116,6844,2612,5396]
[8000000,"31 years - 35 years","31 years - 35 years8000000",19857,22104,31115,16963,9790,3306,7296]
[8000000,"36 years - 40 years","36 years - 40 years8000000",28807,30794,43297,34993,14480,4251,10053]
[8000000,"41 years - 45 years","41 years - 45 years8000000",53150,55410,77743,71661,22945,5612,14379]
[8000000,"46 years - 50 years","46 years - 50 years8000000",70756,80367,159593,120500,37938,7421,20739]
[8000000,"51 years - 55 years","51 years - 55 years8000000",109335,124499,245686,179124,61625,9785,30229]
[8000000,"56 years - 60 years","56 years - 60 years8000000",197077,226792,423050,328301,96944,13887,44950]
[8000000,"61 years - 65 years","61 years - 65 years8000000",278308,328048,678392,442760,160983,21587,76230]
[8000000,"66 years - 70 years","66 years - 70 years8000000",364453,443706,902648,547032,213135,28813,111904]
[8000000,"More than 70 years","More than 70 years8000000",857258,1034615,1934543,1033626,477335,86697,325161]
[8100000,"91 days - 25 years","91 days - 25 years8100000",8887,11369,16712,6264,5490,2323,4584]
[8100000,"26 years - 30 years","26 years - 30 years8100000",12053,14242,20051,8215,6927,2642,5461]
[8100000,"31 years - 35 years","31 years - 35 years8100000",20103,22378,31501,17172,9910,3345,7385]
[8100000,"36 years - 40 years","36 years - 40 years8100000",29165,31177,43836,35428,14659,4302,10177]
[8100000,"41 years - 45 years","41 years - 45 years8100000",53811,56099,78711,72555,23230,5680,14557]
[8100000,"46 years - 50 years","46 years - 50 years8100000",71637,81368,161584,122002,38410,7512,20996]
[8100000,"51 years - 55 years",{"$f":"B899&A899","v":"51 years - 55 years8100000"},110692,126047,248747,181358,62393,9905,30604]
[8100000,"56 years - 60 years","56 years - 60 years8100000",199531,229617,428328,332398,98149,14056,45509]
[8100000,"61 years - 65 years","61 years - 65 years8100000",281777,332140,686863,448288,162989,21852,77180]
[8100000,"66 years - 70 years","66 years - 70 years8100000",368999,449243,913922,553863,215792,29168,113300]
[8100000,"More than 70 years","More than 70 years8100000",867964,1047538,1958715,1046539,483294,87775,329223]
[8200000,"91 days - 25 years","91 days - 25 years8200000",8994,11507,16916,6339,5555,2350,4638]
[8200000,"26 years - 30 years","26 years - 30 years8200000",12199,14416,20297,8314,7010,2672,5527]
[8200000,"31 years - 35 years","31 years - 35 years8200000",20349,22652,31888,17382,10030,3384,7473]
[8200000,"36 years - 40 years","36 years - 40 years8200000",29523,31559,44375,35863,14838,4353,10300]
[8200000,"41 years - 45 years","41 years - 45 years8200000",54472,56788,79679,73448,23515,5748,14734]
[8200000,"46 years - 50 years","46 years - 50 years8200000",72518,82369,163575,123504,38882,7602,21253]
[8200000,"51 years - 55 years","51 years - 55 years8200000",112050,127594,251809,183593,63161,10025,30980]
[8200000,"56 years - 60 years","56 years - 60 years8200000",201985,232443,433607,336495,99354,14224,46068]
[8200000,"61 years - 65 years","61 years - 65 years8200000",285247,336231,695333,453816,164994,22117,78130]
[8200000,"66 years - 70 years","66 years - 70 years8200000",373546,454780,925195,560694,218449,29523,114697]
[8200000,"More than 70 years","More than 70 years8200000",878670,1060461,1982887,1059452,489253,88854,333284]
[8300000,"91 days - 25 years","91 days - 25 years8300000",9102,11645,17120,6414,5621,2376,4693]
[8300000,"26 years - 30 years","26 years - 30 years8300000",12346,14589,20542,8413,7094,2703,5592]
[8300000,"31 years - 35 years","31 years - 35 years8300000",20595,22926,32275,17592,10151,3423,7562]
[8300000,"36 years - 40 years","36 years - 40 years8300000",29881,31942,44914,36299,15017,4404,10424]
[8300000,"41 years - 45 years","41 years - 45 years8300000",55132,57477,80648,74342,23799,5816,14912]
[8300000,"46 years - 50 years","46 years - 50 years8300000",73398,83370,165567,125006,39355,7693,21510]
[8300000,"51 years - 55 years","51 years - 55 years8300000",113407,129141,254871,185828,63930,10145,31356]
[8300000,"56 years - 60 years","56 years - 60 years8300000",204439,235268,438886,340593,100559,14392,46628]
[8300000,"61 years - 65 years","61 years - 65 years8300000",288716,340322,703804,459344,166999,22381,79080]
[8300000,"66 years - 70 years","66 years - 70 years8300000",378092,460317,936469,567526,221106,29878,116093]
[8300000,"More than 70 years","More than 70 years8300000",889376,1073384,2007059,1072365,495212,89932,337346]
[8400000,"91 days - 25 years","91 days - 25 years8400000",9209,11783,17324,6489,5686,2403,4747]
[8400000,"26 years - 30 years","26 years - 30 years8400000",12493,14763,20787,8512,7177,2733,5657]
[8400000,"31 years - 35 years","31 years - 35 years8400000",20841,23200,32662,17802,10271,3462,7651]
[8400000,"36 years - 40 years","36 years - 40 years8400000",30238,32325,45453,36734,15195,4455,10547]
[8400000,"41 years - 45 years","41 years - 45 years8400000",55793,58166,81616,75235,24084,5884,15089]
[8400000,"46 years - 50 years","46 years - 50 years8400000",74279,84371,167558,126508,39827,7783,21767]
[8400000,"51 years - 55 years","51 years - 55 years8400000",114765,130688,257933,188062,64698,10265,31731]
[8400000,"56 years - 60 years","56 years - 60 years8400000",206893,238094,444165,344690,101763,14561,47187]
[8400000,"61 years - 65 years","61 years - 65 years8400000",292186,344413,712274,464872,169004,22646,80031]
[8400000,"66 years - 70 years","66 years - 70 years8400000",382638,465854,947743,574357,223763,30232,117489]
[8400000,"More than 70 years","More than 70 years8400000",900082,1086307,2031231,1085278,501171,91010,341408]
[8500000,"91 days - 25 years","91 days - 25 years8500000",9317,11922,17528,6564,5752,2429,4802]
[8500000,"26 years - 30 years","26 years - 30 years8500000",12639,14937,21033,8612,7260,2764,5722]
[8500000,"31 years - 35 years","31 years - 35 years8500000",21087,23475,33048,18012,10391,3501,7740]
[8500000,"36 years - 40 years","36 years - 40 years8500000",30596,32707,45992,37169,15374,4506,10670]
[8500000,"41 years - 45 years","41 years - 45 years8500000",56454,58855,82584,76129,24368,5952,15267]
[8500000,"46 years - 50 years","46 years - 50 years8500000",75160,85372,169549,128010,40299,7874,22024]
[8500000,"51 years - 55 years","51 years - 55 years8500000",116122,132235,260995,190297,65466,10385,32107]
[8500000,"56 years - 60 years","56 years - 60 years8500000",209348,240920,449444,348787,102968,14729,47746]
[8500000,"61 years - 65 years","61 years - 65 years8500000",295655,348505,720745,470399,171009,22911,80981]
[8500000,"66 years - 70 years","66 years - 70 years8500000",387184,471391,959016,581188,226420,30587,118885]
[8500000,"More than 70 years","More than 70 years8500000",910788,1099229,2055403,1098191,507130,92089,345470]
[8600000,"91 days - 25 years","91 days - 25 years8600000",9424,12060,17732,6639,5818,2456,4856]
[8600000,"26 years - 30 years","26 years - 30 years8600000",12786,15110,21278,8711,7344,2794,5788]
[8600000,"31 years - 35 years","31 years - 35 years8600000",21333,23749,33435,18222,10511,3540,7829]
[8600000,"36 years - 40 years","36 years - 40 years8600000",30954,33090,46531,37604,15553,4557,10794]
[8600000,"41 years - 45 years","41 years - 45 years8600000",57115,59544,83552,77023,24653,6020,15444]
[8600000,"46 years - 50 years","46 years - 50 years8600000",76041,86373,171541,129512,40771,7964,22281]
[8600000,"51 years - 55 years","51 years - 55 years8600000",117480,133782,264057,192532,66234,10505,32482]
[8600000,"56 years - 60 years","56 years - 60 years8600000",211802,243745,454723,352885,104173,14898,48305]
[8600000,"61 years - 65 years","61 years - 65 years8600000",299125,352596,729215,475927,173015,23175,81931]
[8600000,"66 years - 70 years","66 years - 70 years8600000",391731,476927,970290,588019,229077,30942,120281]
[8600000,"More than 70 years","More than 70 years8600000",921494,1112152,2079575,1111104,513090,93167,349531]
[8700000,"91 days - 25 years","91 days - 25 years8700000",9532,12198,17936,6714,5883,2482,4910]
[8700000,"26 years - 30 years","26 years - 30 years8700000",12932,15284,21523,8810,7427,2825,5853]
[8700000,"31 years - 35 years","31 years - 35 years8700000",21579,24023,33822,18431,10631,3580,7918]
[8700000,"36 years - 40 years","36 years - 40 years8700000",31312,33473,47070,38039,15732,4608,10917]
[8700000,"41 years - 45 years",{"$f":"B963&A963","v":"41 years - 45 years8700000"},57776,60233,84520,77916,24938,6088,15622]
[8700000,"46 years - 50 years","46 years - 50 years8700000",76922,87374,173532,131013,41243,8055,22538]
[8700000,"51 years - 55 years","51 years - 55 years8700000",118837,135329,267119,194766,67002,10626,32858]
[8700000,"56 years - 60 years","56 years - 60 years8700000",214256,246571,460001,356982,105378,15066,48865]
[8700000,"61 years - 65 years","61 years - 65 years8700000",302594,356687,737686,481455,175020,23440,82881]
[8700000,"66 years - 70 years","66 years - 70 years8700000",396277,482464,981563,594851,231734,31297,121677]
[8700000,"More than 70 years","More than 70 years8700000",932200,1125075,2103747,1124017,519049,94245,353593]
[8800000,"91 days - 25 years","91 days - 25 years8800000",9639,12336,18141,6790,5949,2509,4965]
[8800000,"26 years - 30 years","26 years - 30 years8800000",13079,15458,21769,8909,7511,2855,5918]
[8800000,"31 years - 35 years","31 years - 35 years8800000",21825,24297,34208,18641,10751,3619,8007]
[8800000,"36 years - 40 years","36 years - 40 years8800000",31670,33856,47609,38475,15910,4659,11041]
[8800000,"41 years - 45 years","41 years - 45 years8800000",58436,60922,85489,78810,25222,6155,15799]
[8800000,"46 years - 50 years","46 years - 50 years8800000",77802,88375,175523,132515,41715,8145,22795]
[8800000,"51 years - 55 years","51 years - 55 years8800000",120195,136876,270180,197001,67770,10746,33234]
[8800000,"56 years - 60 years","56 years - 60 years8800000",216710,249397,465280,361079,106583,15235,49424]
[8800000,"61 years - 65 years","61 years - 65 years8800000",306064,360778,746156,486983,177025,23705,83831]
[8800000,"66 years - 70 years","66 years - 70 years8800000",400823,488001,992837,601682,234391,31652,123073]
[8800000,"More than 70 years","More than 70 years8800000",942906,1137998,2127919,1136930,525008,95324,357655]
[8900000,"91 days - 25 years","91 days - 25 years8900000",9747,12474,18345,6865,6014,2535,5019]
[8900000,"26 years - 30 years","26 years - 30 years8900000",13226,15631,22014,9009,7594,2886,5983]
[8900000,"31 years - 35 years","31 years - 35 years8900000",22071,24571,34595,18851,10872,3658,8096]
[8900000,"36 years - 40 years","36 years - 40 years8900000",32028,34238,48148,38910,16089,4710,11164]
[8900000,"41 years - 45 years","41 years - 45 years8900000",59097,61611,86457,79703,25507,6223,15977]
[8900000,"46 years - 50 years","46 years - 50 years8900000",78683,89376,177515,134017,42187,8236,23052]
[8900000,"51 years - 55 years","51 years - 55 years8900000",121552,138423,273242,199235,68538,10866,33609]
[8900000,"56 years - 60 years","56 years - 60 years8900000",219165,252222,470559,365177,107787,15403,49983]
[8900000,"61 years - 65 years","61 years - 65 years8900000",309533,364870,754627,492511,179030,23969,84782]
[8900000,"66 years - 70 years","66 years - 70 years8900000",405369,493538,1004111,608513,237048,32007,124470]
[8900000,"More than 70 years","More than 70 years8900000",953612,1150921,2152090,1149843,530967,96402,361716]
[9000000,"91 days - 25 years","91 days - 25 years9000000",9854,12612,18549,6940,6080,2562,5074]
[9000000,"26 years - 30 years","26 years - 30 years9000000",13372,15805,22259,9108,7677,2916,6049]
[9000000,"31 years - 35 years","31 years - 35 years9000000",22317,24845,34982,19061,10992,3697,8185]
[9000000,"36 years - 40 years","36 years - 40 years9000000",32386,34621,48687,39345,16268,4760,11288]
[9000000,"41 years - 45 years","41 years - 45 years9000000",59758,62300,87425,80597,25791,6291,16154]
[9000000,"46 years - 50 years","46 years - 50 years9000000",79564,90377,179506,135519,42659,8327,23309]
[9000000,"51 years - 55 years","51 years - 55 years9000000",122910,139970,276304,201470,69306,10986,33985]
[9000000,"56 years - 60 years","56 years - 60 years9000000",221619,255048,475838,369274,108992,15571,50542]
[9000000,"61 years - 65 years","61 years - 65 years9000000",313003,368961,763097,498039,181035,24234,85732]
[9000000,"66 years - 70 years","66 years - 70 years9000000",409916,499075,1015384,615344,239705,32362,125866]
[9000000,"More than 70 years","More than 70 years9000000",964318,1163844,2176262,1162756,536926,97480,365778]
[9100000,"91 days - 25 years","91 days - 25 years9100000",9962,12751,18753,7015,6146,2588,5128]
[9100000,"26 years - 30 years","26 years - 30 years9100000",13519,15978,22505,9207,7761,2946,6114]
[9100000,"31 years - 35 years","31 years - 35 years9100000",22563,25119,35369,19271,11112,3736,8274]
[9100000,"36 years - 40 years","36 years - 40 years9100000",32744,35004,49226,39780,16447,4811,11411]
[9100000,"41 years - 45 years","41 years - 45 years9100000",60419,62989,88393,81490,26076,6359,16332]
[9100000,"46 years - 50 years","46 years - 50 years9100000",80445,91378,181497,137021,43131,8417,23566]
[9100000,"51 years - 55 years","51 years - 55 years9100000",124267,141517,279366,203705,70074,11106,34361]
[9100000,"56 years - 60 years","56 years - 60 years9100000",224073,257874,481117,373371,110197,15740,51102]
[9100000,"61 years - 65 years","61 years - 65 years9100000",316472,373052,771568,503567,183041,24499,86682]
[9100000,"66 years - 70 years","66 years - 70 years9100000",414462,504612,1026658,622175,242362,32717,127262]
[9100000,"More than 70 years","More than 70 years9100000",975024,1176767,2200434,1175669,542885,98559,369840]
[9200000,"91 days - 25 years","91 days - 25 years9200000",10070,12889,18957,7090,6211,2615,5182]
[9200000,"26 years - 30 years","26 years - 30 years9200000",13666,16152,22750,9306,7844,2977,6179]
[9200000,"31 years - 35 years","31 years - 35 years9200000",22809,25393,35755,19481,11232,3775,8363]
[9200000,"36 years - 40 years","36 years - 40 years9200000",33102,35387,49765,40215,16626,4862,11535]
[9200000,"41 years - 45 years","41 years - 45 years9200000",61079,63678,89361,82384,26361,6427,16510]
[9200000,"46 years - 50 years","46 years - 50 years9200000",81326,92379,183488,138523,43603,8508,23824]
[9200000,"51 years - 55 years","51 years - 55 years9200000",125625,143064,282428,205939,70842,11226,34736]
[9200000,"56 years - 60 years","56 years - 60 years9200000",226527,260699,486396,377469,111402,15908,51661]
[9200000,"61 years - 65 years","61 years - 65 years9200000",319942,377144,780038,509095,185046,24763,87632]
[9200000,"66 years - 70 years","66 years - 70 years9200000",419008,510149,1037931,629007,245019,33072,128658]
[9200000,"More than 70 years","More than 70 years9200000",985730,1189690,2224606,1188582,548844,99637,373902]
[9300000,"91 days - 25 years","91 days - 25 years9300000",10177,13027,19161,7165,6277,2641,5237]
[9300000,"26 years - 30 years","26 years - 30 years9300000",13812,16326,22996,9406,7927,3007,6244]
[9300000,"31 years - 35 years",{"$f":"B1027&A1027","v":"31 years - 35 years9300000"},23055,25667,36142,19690,11352,3814,8452]
[9300000,"36 years - 40 years","36 years - 40 years9300000",33459,35769,50304,40651,16804,4913,11658]
[9300000,"41 years - 45 years","41 years - 45 years9300000",61740,64367,90329,83277,26645,6495,16687]
[9300000,"46 years - 50 years","46 years - 50 years9300000",82207,93380,185480,140025,44075,8598,24081]
[9300000,"51 years - 55 years","51 years - 55 years9300000",126982,144611,285490,208174,71610,11346,35112]
[9300000,"56 years - 60 years","56 years - 60 years9300000",228981,263525,491674,381566,112607,16077,52220]
[9300000,"61 years - 65 years","61 years - 65 years9300000",323411,381235,788509,514623,187051,25028,88583]
[9300000,"66 years - 70 years","66 years - 70 years9300000",423554,515686,1049205,635838,247676,33427,130054]
[9300000,"More than 70 years","More than 70 years9300000",996436,1202613,2248778,1201495,554803,100715,377963]
[9400000,"91 days - 25 years","91 days - 25 years9400000",10285,13165,19365,7240,6342,2668,5291]
[9400000,"26 years - 30 years","26 years - 30 years9400000",13959,16499,23241,9505,8011,3038,6310]
[9400000,"31 years - 35 years","31 years - 35 years9400000",23301,25941,36529,19900,11472,3853,8541]
[9400000,"36 years - 40 years","36 years - 40 years9400000",33817,36152,50843,41086,16983,4964,11782]
[9400000,"41 years - 45 years","41 years - 45 years9400000",62401,65056,91298,84171,26930,6563,16865]
[9400000,"46 years - 50 years","46 years - 50 years9400000",83087,94381,187471,141527,44547,8689,24338]
[9400000,"51 years - 55 years","51 years - 55 years9400000",128340,146158,288551,210409,72379,11466,35488]
[9400000,"56 years - 60 years","56 years - 60 years9400000",231436,266350,496953,385663,113811,16245,52779]
[9400000,"61 years - 65 years","61 years - 65 years9400000",326881,385326,796979,520151,189056,25293,89533]
[9400000,"66 years - 70 years","66 years - 70 years9400000",428101,521223,1060479,642669,250333,33782,131450]
[9400000,"More than 70 years","More than 70 years9400000",1007142,1215536,2272950,1214409,560762,101794,382025]
[9500000,"91 days - 25 years","91 days - 25 years9500000",10392,13303,19570,7316,6408,2694,5346]
[9500000,"26 years - 30 years","26 years - 30 years9500000",14105,16673,23486,9604,8094,3068,6375]
[9500000,"31 years - 35 years","31 years - 35 years9500000",23547,26216,36916,20110,11593,3892,8630]
[9500000,"36 years - 40 years","36 years - 40 years9500000",34175,36535,51382,41521,17162,5015,11905]
[9500000,"41 years - 45 years","41 years - 45 years9500000",63062,65745,92266,85065,27214,6631,17042]
[9500000,"46 years - 50 years","46 years - 50 years9500000",83968,95382,189462,143029,45019,8779,24595]
[9500000,"51 years - 55 years","51 years - 55 years9500000",129697,147705,291613,212643,73147,11586,35863]
[9500000,"56 years - 60 years","56 years - 60 years9500000",233890,269176,502232,389760,115016,16414,53339]
[9500000,"61 years - 65 years","61 years - 65 years9500000",330350,389417,805450,525679,191061,25557,90483]
[9500000,"66 years - 70 years","66 years - 70 years9500000",432647,526760,1071752,649500,252990,34137,132846]
[9500000,"More than 70 years","More than 70 years9500000",1017847,1228458,2297122,1227322,566721,102872,386087]
[9600000,"91 days - 25 years","91 days - 25 years9600000",10500,13441,19774,7391,6473,2721,5400]
[9600000,"26 years - 30 years","26 years - 30 years9600000",14252,16847,23732,9703,8177,3099,6440]
[9600000,"31 years - 35 years","31 years - 35 years9600000",23793,26490,37302,20320,11713,3932,8719]
[9600000,"36 years - 40 years","36 years - 40 years9600000",34533,36917,51921,41956,17341,5066,12028]
[9600000,"41 years - 45 years","41 years - 45 years9600000",63722,66434,93234,85958,27499,6699,17220]
[9600000,"46 years - 50 years","46 years - 50 years9600000",84849,96383,191454,144530,45491,8870,24852]
[9600000,"51 years - 55 years","51 years - 55 years9600000",131055,149252,294675,214878,73915,11706,36239]
[9600000,"56 years - 60 years","56 years - 60 years9600000",236344,272002,507511,393858,116221,16582,53898]
[9600000,"61 years - 65 years","61 years - 65 years9600000",333820,393509,813920,531207,193067,25822,91433]
[9600000,"66 years - 70 years","66 years - 70 years9600000",437193,532297,1083026,656331,255647,34492,134242]
[9600000,"More than 70 years","More than 70 years9600000",1028553,1241381,2321294,1240235,572681,103950,390149]
[9700000,"91 days - 25 years","91 days - 25 years9700000",10607,13580,19978,7466,6539,2747,5454]
[9700000,"26 years - 30 years","26 years - 30 years9700000",14399,17020,23977,9803,8261,3129,6505]
[9700000,"31 years - 35 years","31 years - 35 years9700000",24039,26764,37689,20530,11833,3971,8808]
[9700000,"36 years - 40 years","36 years - 40 years9700000",34891,37300,52460,42391,17520,5117,12152]
[9700000,"41 years - 45 years","41 years - 45 years9700000",64383,67123,94202,86852,27784,6767,17397]
[9700000,"46 years - 50 years","46 years - 50 years9700000",85730,97384,193445,146032,45963,8960,25109]
[9700000,"51 years - 55 years","51 years - 55 years9700000",132412,150799,297737,217113,74683,11826,36614]
[9700000,"56 years - 60 years","56 years - 60 years9700000",238798,274827,512790,397955,117426,16750,54457]
[9700000,"61 years - 65 years","61 years - 65 years9700000",337289,397600,822391,536735,195072,26087,92383]
[9700000,"66 years - 70 years","66 years - 70 years9700000",441739,537833,1094300,663163,258304,34847,135639]
[9700000,"More than 70 years","More than 70 years9700000",1039259,1254304,2345466,1253148,578640,105029,394210]
[9800000,"91 days - 25 years","91 days - 25 years9800000",10715,13718,20182,7541,6605,2774,5509]
[9800000,"26 years - 30 years","26 years - 30 years9800000",14545,17194,24222,9902,8344,3160,6571]
[9800000,"31 years - 35 years","31 years - 35 years9800000",24285,27038,38076,20739,11953,4010,8897]
[9800000,"36 years - 40 years","36 years - 40 years9800000",35249,37683,52999,42827,17698,5168,12275]
[9800000,"41 years - 45 years","41 years - 45 years9800000",65044,67812,95170,87745,28068,6835,17575]
[9800000,"46 years - 50 years","46 years - 50 years9800000",86611,98385,195436,147534,46435,9051,25366]
[9800000,"51 years - 55 years","51 years - 55 years9800000",133770,152346,300799,219347,75451,11947,36990]
[9800000,"56 years - 60 years","56 years - 60 years9800000",241252,277653,518069,402052,118630,16919,55016]
[9800000,"61 years - 65 years","61 years - 65 years9800000",340759,401691,830861,542262,197077,26351,93334]
[9800000,"66 years - 70 years","66 years - 70 years9800000",446286,543370,1105573,669994,260961,35202,137035]
[9800000,"More than 70 years","More than 70 years9800000",1049965,1267227,2369638,1266061,584599,106107,398272]
[9900000,"91 days - 25 years",{"$f":"B1091&A1091","v":"91 days - 25 years9900000"},10822,13856,20386,7616,6670,2800,5563]
[9900000,"26 years - 30 years","26 years - 30 years9900000",14692,17368,24468,10001,8427,3190,6636]
[9900000,"31 years - 35 years","31 years - 35 years9900000",24531,27312,38462,20949,12073,4049,8986]
[9900000,"36 years - 40 years","36 years - 40 years9900000",35607,38066,53538,43262,17877,5219,12399]
[9900000,"41 years - 45 years","41 years - 45 years9900000",65705,68501,96138,88639,28353,6903,17752]
[9900000,"46 years - 50 years","46 years - 50 years9900000",87492,99386,197427,149036,46907,9142,25623]
[9900000,"51 years - 55 years","51 years - 55 years9900000",135127,153893,303861,221582,76219,12067,37366]
[9900000,"56 years - 60 years","56 years - 60 years9900000",243707,280479,523347,406150,119835,17087,55576]
[9900000,"61 years - 65 years","61 years - 65 years9900000",344228,405782,839332,547790,199082,26616,94284]
[9900000,"66 years - 70 years","66 years - 70 years9900000",450832,548907,1116847,676825,263618,35556,138431]
[9900000,"More than 70 years","More than 70 years9900000",1060671,1280150,2393810,1278974,590558,107185,402334]
[10000000,"91 days - 25 years","91 days - 25 years10000000",10930,13994,20590,7691,6736,2827,5618]
[10000000,"26 years - 30 years","26 years - 30 years10000000",14839,17541,24713,10100,8511,3220,6701]
[10000000,"31 years - 35 years","31 years - 35 years10000000",24777,27586,38849,21159,12193,4088,9075]
[10000000,"36 years - 40 years","36 years - 40 years10000000",35965,38448,54078,43697,18056,5270,12522]
[10000000,"41 years - 45 years","41 years - 45 years10000000",66365,69190,97107,89532,28637,6971,17930]
[10000000,"46 years - 50 years","46 years - 50 years10000000",88372,100387,199419,150538,47379,9232,25880]
[10000000,"51 years - 55 years","51 years - 55 years10000000",136485,155440,306923,223817,76987,12187,37741]
[10000000,"56 years - 60 years","56 years - 60 years10000000",246161,283304,528626,410247,121040,17256,56135]
[10000000,"61 years - 65 years","61 years - 65 years10000000",347698,409874,847802,553318,201087,26880,95234]
[10000000,"66 years - 70 years","66 years - 70 years10000000",455378,554444,1128120,683656,266275,35911,139827]
[10000000,"More than 70 years","More than 70 years10000000",1071377,1293073,2417982,1291887,596517,108264,406396]